program: Gaussian 09
title: 000282872
version: EM64L-G09RevD.01
frameworkgroup: C1[X(C11H16N2O)]
method: RPBEPBE
basis: SDD
operation: Freq
keyword: #p
keyword: freq=noraman
keyword: PBEPBE/SDD
title: #p freq=noraman PBEPBE/SDD
converged: YES YES NO NO
title: Mulliken charges:
elementType: O N N C C C C C C C C C C C H H H H H H H H H H H H H H H H
charge: -0.296495 -0.424161 -0.494815 -0.017656 -0.393255 -0.684101 -0.711842 0.296664 0.478952 -0.449917 -0.344535 -0.198202 -0.213681 -0.261654 0.199279 0.215002 0.258228 0.206788 0.228635 0.213590 0.198959 0.210929 0.225589 0.282138 0.283813 0.211398 0.307485 0.222873 0.223629 0.226364
chargesum: 0.00000
title: Mulliken charges with hydrogens summed into heavy atoms:
elementType: O N N C C C C C C C C C C C
charge: -0.296495 -0.142023 -0.211002 0.181623 0.079975 -0.035089 -0.076365 0.296664 0.478952 -0.238519 -0.037050 0.024671 0.009948 -0.035290
polarizability: 2.05582057e+02 3.33630786e+00 1.32515659e+02 -1.47303499e+01 6.30487339e-01 8.20314552e+01
1716.lowfreq: -17.1375 -10.3334 -4.7928 -0.0006 -0.0006 0.0003 24.5136 32.9481 47.5879
frequency: 23.8494 32.0062 47.4035 65.3945 86.3281 130.6383 190.0982 225.4462 232.5020 237.1691 270.1568 320.2175 337.3124 360.9246 368.4578 388.1733 407.1780 509.6645 562.4141 588.9691 608.6276 620.9076 695.6809 702.1118 708.6822 763.4979 777.0952 831.2947 837.6105 886.3758 910.4417 916.4254 951.3972 957.9759 967.4180 979.4372 984.3662 996.8889 1024.6907 1057.8568 1088.7893 1130.6182 1145.6820 1170.8056 1187.5118 1188.1891 1211.2552 1258.6171 1268.4181 1306.3581 1318.7425 1331.2550 1361.0706 1374.1084 1383.2534 1393.8925 1426.6222 1451.0877 1462.3788 1472.8933 1481.6934 1483.3951 1487.6964 1493.5056 1513.6277 1598.7933 1616.7206 1645.6849 2962.8108 2964.7529 2978.4385 2983.0157 3053.6565 3067.6639 3070.8737 3073.3895 3084.2049 3102.7963 3129.6007 3141.0566 3163.7189 3194.0990 3523.6211 3553.9936
redmass: 3.7574 3.6928 2.5991 5.5225 4.9524 3.4329 1.0931 3.4036 2.5175 1.1186 4.5658 3.9773 3.8558 1.8597 1.7396 1.8946 2.9288 2.6113 3.0668 1.3278 4.5622 4.2448 1.9943 9.0695 4.9448 1.7008 3.3492 4.7885 1.2769 1.7434 1.4298 1.3283 1.5570 2.0702 1.3464 3.0034 4.9369 1.3011 2.2405 1.9330 1.5614 2.4204 2.0068 1.0510 1.1955 1.7685 1.8810 1.1700 2.1416 1.6198 1.4827 1.5291 1.2717 1.2274 4.6669 1.2551 2.3684 1.0950 1.0588 1.0531 1.1012 1.5583 1.4712 1.4671 2.2365 5.7322 5.8263 4.2999 1.0400 1.0739 1.0401 1.0672 1.0993 1.0984 1.0976 1.0986 1.0994 1.0884 1.0865 1.0932 1.0997 1.0949 1.0760 1.0768
irintensity: 0.0599 0.7880 0.2129 9.1374 4.6957 2.0675 0.5854 0.5296 0.6715 0.4745 13.3543 0.2765 0.6869 4.3057 31.0119 8.4875 0.0480 57.4500 13.2745 118.4994 6.4210 4.4820 52.5209 5.9936 3.2643 92.6823 7.3330 3.0244 0.1590 3.7218 13.6732 1.8760 0.5744 6.2055 0.1439 0.3377 2.9130 3.2769 11.9033 12.5496 14.3787 8.5287 8.5572 0.7694 0.9755 30.4696 268.5435 103.5951 10.8258 23.4054 65.8678 20.2894 2.8404 24.3329 72.4995 18.0965 57.2040 21.8949 12.1070 5.4638 7.2491 289.8306 7.3624 74.0069 556.5783 41.4842 67.1817 146.3741 24.2553 21.0051 56.1878 57.6978 51.9545 7.0643 7.3692 99.7182 32.7648 19.7175 0.3780 34.6809 25.9261 8.8008 5.0199 17.2200
temp: 298.150 k
press: 1.00000 atm
elementType: 8 7 7 6 6 6 6 6 6 6 6 6 6 6 1 1 1 1 1 1 1 1 1 1 1 1 1 1 1 1
symmnumber: 1
zpe: 663110.6 jmol-1
zpe.correction: 0.252566 hartree
zpe.thermalcorrener: 0.267176 hartree
zpe.thermalcorrenthalpy: 0.268120 hartree
zpe.thermalcorrgfe: 0.209229 hartree
zpe.sumelectzpe: -612.462546 hartree
zpe.sumelectthermal: -612.447936 hartree
zpe.sumelectthermalent: -612.446991 hartree
zpe.sumelectthermalfe: -612.505882 hartree
dipole: 1.9031 3.9126 0.0095
dipole: 4.3509
quadrupole: -74.1692 -79.4208 -89.2182
quadrupole: 1.5538 -2.9010 -2.1285
quadrupole: 6.7669 1.5152 -8.2822 1.5538 -2.9010 -2.1285
hfenergy: -612.7151111 hartree
pointgroup: C01 [X(C11H16N2O1)]
dipole: -0.7352354 1.5142913 0.310712 debye
polarizability: 205.458843|-0.8611917|130.7064758|-15.4760468|9.5555797|83.9638526 unknown
InChI: InChI=1S/C11H16N2O/c1-9(2)8-12-11(14)13-10-6-4-3-5-7-10/h3-7,9,12-13H,8H2,1-2H3
charge 0 multiplicity 1
30 atoms
O  -0.646803 -1.504959 0.285881
N  -1.927218 0.376428 0.828748
N  0.369873 0.626032 0.44645
C  -4.194413 -0.100033 -0.215564
C  -3.188356 -0.372559 0.938588
C  -3.622142 -0.541891 -1.58104
C  -4.647012 1.379813 -0.245591
C  -0.725658 -0.25792 0.502095
C  1.724843 0.323612 0.138829
C  2.650926 1.40378 0.15449
C  2.182159 -0.984208 -0.179133
C  4.010966 1.183743 -0.142005
C  3.547789 -1.185761 -0.474232
C  4.471338 -0.115392 -0.459698
H  -5.084379 -0.725089 0.011387
H  -3.666843 -0.132141 1.909435
H  -2.910771 -1.440959 0.948332
H  -4.359307 -0.380762 -2.389354
H  -3.342243 -1.6103 -1.571432
H  -2.712453 0.036048 -1.829029
H  -3.80459 2.04711 -0.513646
H  -5.050347 1.703618 0.733277
H  -5.436611 1.534487 -1.00326
H  -1.954509 1.384393 0.986315
H  0.189065 1.60937 0.659437
H  2.304361 2.417079 0.399526
H  1.468876 -1.80997 -0.188442
H  4.709578 2.027842 -0.124537
H  3.890786 -2.197786 -0.718348
H  5.527795 -0.288224 -0.69048
