program: Gaussian 09
title: 000282873
version: EM64L-G09RevD.01
frameworkgroup: C1[X(C13H10INO)]
method: RPBEPBE
basis: SDD
operation: Freq
keyword: #p
keyword: freq=noraman
keyword: PBEPBE/SDD
title: #p freq=noraman PBEPBE/SDD
converged: YES YES NO NO
title: Mulliken charges:
elementType: I O N C C C C C C C C C C C C C H H H H H H H H H H
charge: 0.120297 -0.262755 -0.474372 0.259938 0.494346 0.134732 -0.331772 -0.341573 -0.344608 -0.449321 -0.159552 -0.172750 -0.213875 -0.197586 -0.344496 -0.253335 0.309655 0.281802 0.223058 0.309681 0.217602 0.255891 0.253194 0.228271 0.227210 0.230317
chargesum: 0.00000
title: Mulliken charges with hydrogens summed into heavy atoms:
elementType: I O N C C C C C C C C C C C C C
charge: 0.120297 -0.262755 -0.164717 0.259938 0.494346 0.134732 -0.049970 -0.118515 -0.034927 -0.231719 0.096340 0.080443 0.014397 0.029624 -0.344496 -0.023019
polarizability: 3.42924822e+02 -3.25641363e+00 1.56513405e+02 2.90780977e+00 -2.57438897e+00 6.51117914e+01
1716.lowfreq: -3.3180 -0.0006 -0.0005 -0.0004 7.1029 8.8993 28.8829 34.8676 55.5702
frequency: 28.8354 34.7864 55.5546 82.0423 97.4177 152.1718 171.0484 219.3186 252.1906 293.6058 323.5825 351.4640 402.7427 407.2190 448.7358 495.7511 514.4465 574.5003 614.9196 620.9968 642.9297 676.9183 689.8518 696.4331 738.8840 770.7506 812.1905 829.2506 843.2033 854.5183 864.5249 919.4906 955.3690 974.2583 984.4109 988.1521 991.3124 1002.0871 1025.1447 1053.8613 1081.7607 1097.2124 1116.3458 1172.8252 1187.7241 1194.4772 1243.2215 1258.3745 1297.9681 1320.9948 1360.5590 1384.8737 1387.5782 1427.9050 1465.5376 1484.9071 1514.4344 1559.3462 1589.7184 1598.1238 1607.4631 1615.2876 3106.4751 3125.1650 3133.1867 3145.5294 3156.3963 3166.2803 3169.0721 3177.3357 3199.1759 3532.2280
redmass: 6.1211 3.8184 6.3268 7.7710 5.7890 10.2903 7.0824 5.1340 5.9804 5.4350 5.8142 7.3023 2.8388 2.9232 4.7389 4.6581 2.7861 6.2047 6.4561 6.4379 1.2506 4.4405 6.8831 2.0128 3.2702 1.7151 3.4766 1.6997 1.2698 1.6330 4.6627 1.4278 1.3820 1.3530 6.1119 1.6324 3.3251 1.3099 2.2828 3.0519 1.9471 2.0132 1.4345 1.0520 1.1140 1.1238 3.6746 1.9052 1.2660 1.5051 5.0210 5.2899 4.2652 2.3727 2.2705 2.4110 2.1884 7.0655 6.0998 8.0635 3.9480 6.2748 1.0890 1.0890 1.0867 1.0933 1.0888 1.0999 1.0950 1.0970 1.0949 1.0758
irintensity: 0.0124 0.1332 0.3018 5.6506 0.2291 1.6972 1.8358 4.2499 3.5854 0.4857 1.9720 13.1474 0.2808 0.1390 12.4342 4.0589 39.2938 10.0938 2.0342 3.3283 25.0356 17.9866 9.5918 51.4652 16.6881 106.7632 15.6603 10.1167 0.1708 29.7967 35.5098 13.9804 1.6679 0.2586 0.4286 26.0469 57.2452 3.2268 5.9429 10.4058 44.1732 16.8433 11.6580 0.5117 0.2019 12.8121 45.2565 68.2050 0.5024 83.5979 0.1286 72.2436 26.5950 129.5038 52.7409 96.8123 378.0534 25.7255 85.5095 95.9440 42.3824 34.0734 15.9321 14.9910 0.2823 28.5698 0.3629 29.9179 6.1389 2.4342 8.6424 9.0346
temp: 298.150 k
press: 1.00000 atm
elementType: 53 8 7 6 6 6 6 6 6 6 6 6 6 6 6 6 1 1 1 1 1 1 1 1 1 1
symmnumber: 1
zpe: 510400.8 jmol-1
zpe.correction: 0.194401 hartree
zpe.thermalcorrener: 0.208150 hartree
zpe.thermalcorrenthalpy: 0.209094 hartree
zpe.thermalcorrgfe: 0.150579 hartree
zpe.sumelectzpe: -641.774184 hartree
zpe.sumelectthermal: -641.760435 hartree
zpe.sumelectthermalent: -641.759491 hartree
zpe.sumelectthermalfe: -641.818006 hartree
dipole: 0.3448 -3.1783 -0.4328
dipole: 3.2261
quadrupole: -100.0522 -101.5198 -113.4424
quadrupole: -9.0444 -0.3621 -1.7173
quadrupole: 4.9526 3.4850 -8.4376 -9.0444 -0.3621 -1.7173
hfenergy: -641.9685853 hartree
pointgroup: C01 [X(C13H10I1N1O1)]
dipole: -0.2264591 1.2390845 -0.1561504 debye
dipolederiv: -0.6412756 -0.1173064 0.0132988 -0.1473238 -0.0367294 -0.0030583 0.0129221 -0.002369 0.0078953 -0.8046585 -0.1823975 0.0021191 0.3250116 -0.9108303 0.076605 -0.0704658 0.0433066 -0.3524027 -1.8544056 0.3119825 -0.0490068 0.6636406 -0.4713647 0.0004516 -0.1274163 -0.0115802 -0.300728 -0.4403534 -0.0932339 0.0150241 -0.1769363 -0.0856127 0.0113915 0.0580276 0.0070559 -0.0076426 1.3197209 -0.0973827 -0.0012611 0.117457 0.0251455 0.0123114 0.0021117 0.0091216 0.1024534 2.067565 -0.0048492 0.0375391 -0.8688291 1.182621 -0.1446191 0.159847 -0.0796733 0.2224536 0.0732999 0.1253169 0.0146892 -0.1783754 0.0164415 0.0500127 -0.0257696 0.004942 -0.0933348 0.032074 -0.0340614 -0.0534267 0.213799 0.01839 0.0454658 -0.0700911 0.0518674 -0.1101471 -0.3261007 -0.001633 0.0004687 -0.1399442 -0.0600498 -0.0169715 0.0240331 -0.011106 -0.161339 -0.2681406 0.0335015 -0.0057273 0.1515838 0.0053675 -0.0405809 -0.0193683 -0.0358559 -0.2053368 -0.4644626 -0.2868107 -0.0545694 -0.1905181 -0.040054 0.0268482 -0.0297205 0.0409837 -0.0789423 -0.6269938 0.0139888 0.0496736 -0.0395782 0.039456 0.0480678 0.0356101 0.0396788 -0.080129 0.0925391 0.0383609 -0.0104612 0.1318519 0.1370322 -0.0467326 -0.0268542 -0.043288 -0.1358422 0.0388123 -0.0083752 -0.0030223 -0.1406026 0.1244508 -0.0400052 0.0178251 -0.0414654 -0.1329548 1.3793291 0.297273 -0.0440697 0.2893015 0.0544711 0.03703 -0.052551 0.0345568 -0.1471416 -0.0487523 0.0125604 -0.0055188 0.0348228 -0.1426761 -0.0061102 -0.0076184 -0.0066983 -0.1813223 0.2402764 -0.0050589 0.0057823 -0.0844049 0.090961 0.0317352 0.0340753 0.0305114 0.284604 0.118248 -0.0598847 -0.0103287 -0.0163207 0.0295346 -0.0413521 -0.0276981 -0.0243965 0.1492108 -0.0456327 0.089687 0.0471337 0.1069168 0.01801 -0.0492937 0.0641953 -0.0391268 0.1264007 0.1917944 0.0542781 -0.0069135 0.0333116 0.0620211 0.0200613 -0.0117606 0.0128393 0.1790263 0.0083357 -0.1208861 0.0227719 -0.1034115 -0.0405497 0.0376391 0.0199541 0.0334448 0.1597175 0.0109707 0.073538 0.0328241 0.0707214 0.039116 -0.0407716 0.0339164 -0.0414317 0.1442393 0.0689483 -0.0476818 -0.0068692 -0.0577525 -0.0216568 -0.0528989 -0.0031017 -0.0529973 0.1447668 0.011606 -0.0764743 0.0161052 -0.1131949 -0.0583209 0.0367319 0.0218649 0.0349881 0.1470303 0.0139647 0.0845029 -0.0118825 0.1158389 -0.0683258 0.0353982 -0.0169931 0.0348615 0.152316 -0.1467088 0.0010458 0.0056275 0.0029354 0.0931517 0.0126445 0.0050261 0.0118304 0.1671492 unknown
polarizability: 342.3500045|10.1679283|156.9516652|-5.6334006|3.1509681|65.2483488 unknown
InChI: InChI=1S/C13H10INO/c14-11-8-6-10(7-9-11)13(16)15-12-4-2-1-3-5-12/h1-9,15H
charge 0 multiplicity 1
26 atoms
I  6.340904 0.827487 -0.091958
O  -0.270116 -1.956321 0.148655
N  -0.888059 0.299199 -0.081054
C  1.490421 -0.295869 0.018616
C  -2.310445 0.219305 -0.047102
C  0.045261 -0.73048 0.0421
C  2.451975 -1.276045 -0.334862
C  1.936288 1.006292 0.365957
C  -3.017589 -0.995075 0.16487
C  -3.031453 1.430877 -0.233383
C  3.825941 -0.964722 -0.372706
C  3.310536 1.332031 0.338102
C  -4.428922 -0.974776 0.190062
C  -4.440027 1.432375 -0.207125
C  4.245801 0.343396 -0.040106
C  -5.14972 0.227201 0.005913
H  -0.513551 1.232261 -0.265801
H  2.100685 -2.285814 -0.569638
H  1.23396 1.776184 0.708296
H  -2.459951 -1.923163 0.298559
H  -2.488712 2.371373 -0.398218
H  4.554588 -1.72957 -0.654457
H  3.642502 2.335674 0.618237
H  -4.968303 -1.914395 0.354022
H  -4.982031 2.37325 -0.352522
H  -6.24458 0.226725 0.026544
