program: Gaussian 09
title: 000282881
version: EM64L-G09RevD.01
frameworkgroup: C1[X(C12H24O2S2)]
method: RPBEPBE
basis: SDD
operation: Freq
keyword: #p
keyword: freq=noraman
keyword: PBEPBE/SDD
title: #p freq=noraman PBEPBE/SDD
converged: YES YES NO NO
title: Mulliken charges:
elementType: S S O O C C C C C C C C C C C C H H H H H H H H H H H H H H H H H H H H H H H H
charge: 0.230233 0.200857 -0.435146 -0.433311 0.349485 -0.601677 -0.342952 -0.311822 -0.443291 -0.758498 -0.726102 -0.639127 -0.609848 -0.364624 -0.363559 -0.339218 0.214076 0.244431 0.202864 0.224761 0.186444 0.238619 0.212318 0.217765 0.219965 0.208503 0.231181 0.204069 0.268181 0.276137 0.260715 0.272901 0.229352 0.193348 0.218624 0.205929 0.179061 0.221055 0.330053 0.328246
chargesum: 0.00000
title: Mulliken charges with hydrogens summed into heavy atoms:
elementType: S S O O C C C C C C C C C C C C
charge: 0.230233 0.200857 -0.105093 -0.105064 0.349485 -0.601677 0.115555 0.115804 -0.018229 -0.108450 -0.082349 -0.094809 -0.076231 0.058076 0.060994 0.060898
polarizability: 1.92713176e+02 -1.39830579e+01 1.64603345e+02 5.46193542e+00 1.73695016e+00 1.49856258e+02
1716.lowfreq: -12.5880 -6.9698 0.0013 0.0023 0.0024 10.2568 32.2817 46.7811 50.7699
frequency: 31.9585 46.3730 50.7444 67.8586 72.9206 79.3742 86.6735 123.9488 156.9548 165.7254 177.8887 215.2757 226.3295 229.7930 245.4035 249.0196 261.9240 281.4329 295.0813 315.1446 322.0205 330.2767 360.6763 377.2753 393.2349 433.3493 442.5562 462.0085 481.3545 506.6332 573.7296 628.9077 643.4254 665.5095 758.3488 780.2003 789.2706 849.8181 856.1912 877.4905 901.4661 925.0573 935.2755 947.4250 953.8060 959.1293 989.7472 998.5113 1008.9275 1030.8012 1050.7993 1056.8638 1062.6738 1079.1657 1105.8400 1111.2426 1123.0331 1136.9044 1146.8886 1165.3051 1203.9461 1234.0991 1241.7759 1256.6504 1270.8257 1275.2581 1289.9036 1292.4031 1302.5683 1314.8062 1320.9116 1340.7535 1349.1363 1353.4469 1376.7374 1380.3243 1388.4321 1397.3572 1430.3562 1437.9188 1440.8736 1444.7580 1461.1910 1464.7301 1469.9742 1474.5443 1481.6274 1484.6827 1486.9802 1493.1846 2941.0501 2954.3227 2964.4022 2966.5860 2967.4933 2971.0405 2973.1460 2974.7252 3019.4615 3020.6467 3029.1461 3039.1918 3048.3892 3052.5074 3059.9815 3066.8969 3067.5807 3075.0166 3079.5998 3083.9255 3092.7625 3111.4188 3555.5031 3555.5931
redmass: 4.8858 3.6757 5.1629 3.0378 3.4157 3.2560 1.9638 4.4214 2.8387 5.1053 3.0982 1.6535 2.1973 2.3568 2.3667 3.0515 2.4190 1.1417 2.3273 1.2334 1.1636 3.0394 2.3776 7.5545 3.0000 3.3631 3.7963 2.4549 2.6146 3.7249 3.7433 6.1729 3.9476 3.9026 2.6794 1.1842 1.2584 1.7206 1.5820 1.6107 2.1693 1.8830 1.6172 2.3135 1.8037 3.8706 1.7714 2.2187 2.2588 1.8371 2.2173 2.9699 2.6107 1.8479 1.0561 2.1120 1.2809 1.5102 1.4352 2.2840 2.6113 2.1106 1.3253 1.2502 1.2865 1.1756 1.2020 1.1837 1.2605 1.2538 1.3028 1.3127 1.3716 1.4275 1.2003 1.2333 1.2227 1.2111 1.0827 1.0973 1.0789 1.0838 1.0565 1.0529 1.0734 1.0632 1.0611 1.0760 1.0879 1.0724 1.0696 1.0690 1.0590 1.0497 1.0602 1.0483 1.0616 1.0449 1.0562 1.0971 1.0591 1.0962 1.0965 1.0882 1.0983 1.0990 1.0990 1.0985 1.0979 1.0987 1.1073 1.1079 1.0661 1.0661
irintensity: 0.1033 1.6529 0.8389 1.2719 3.3539 6.1387 5.3227 0.3318 0.9297 2.3101 2.9409 4.1710 0.6181 7.4809 4.5658 1.4312 1.1569 5.6155 7.5802 101.1293 167.9289 13.7836 10.2188 5.4810 3.9300 0.2874 14.3277 1.4154 0.7477 1.3212 5.3438 2.2500 2.2429 10.4988 1.5308 8.5785 10.3254 9.2665 9.8474 4.4681 20.0594 13.0133 15.3776 26.3281 36.5002 75.3782 13.2240 42.6676 4.9129 0.3902 1.1475 6.4050 4.6573 21.2395 5.7227 5.0724 32.9224 10.5351 0.8804 7.8599 39.5517 9.7813 43.5184 3.7472 7.0363 3.2952 11.3694 2.3165 5.3187 3.1232 1.3773 3.8238 4.1762 11.5217 17.0734 35.9601 16.7764 14.1403 11.7903 1.5839 15.1836 5.4920 6.5834 7.9362 0.4821 1.1120 7.0595 1.6134 11.7851 27.3409 53.4542 49.1940 16.9929 4.2987 8.0026 79.4449 43.8632 27.8193 15.2482 6.9030 45.3747 9.0815 8.3651 16.2186 38.2953 42.6602 36.5147 40.0101 69.5059 37.0566 0.1842 21.4648 4.5470 7.7100
temp: 298.150 k
press: 1.00000 atm
elementType: 16 16 8 8 6 6 6 6 6 6 6 6 6 6 6 6 1 1 1 1 1 1 1 1 1 1 1 1 1 1 1 1 1 1 1 1 1 1 1 1
symmnumber: 1
zpe: 899780.2 jmol-1
zpe.correction: 0.342708 hartree
zpe.thermalcorrener: 0.363045 hartree
zpe.thermalcorrenthalpy: 0.363989 hartree
zpe.thermalcorrgfe: 0.293636 hartree
zpe.sumelectzpe: -1416.888402 hartree
zpe.sumelectthermal: -1416.868065 hartree
zpe.sumelectthermalent: -1416.867121 hartree
zpe.sumelectthermalfe: -1416.937474 hartree
dipole: -0.6455 -3.7675 -2.0383
dipole: 4.3319
quadrupole: -101.3008 -130.2743 -119.8382
quadrupole: -9.3416 2.1809 -8.2302
quadrupole: 15.8370 -13.1366 -2.7005 -9.3416 2.1809 -8.2302
hfenergy: -1417.2311103 hartree
pointgroup: C01 [X(C12H24O2S2)]
dipole: 0.5896942 1.4285485 -0.7184093 debye
polarizability: 186.8874002|-18.0973217|171.1167203|-3.8466773|-1.1264578|149.1686587 unknown
InChI: InChI=1S/C12H24O2S2/c1-11(2,5-7-14)10-12(4-3-6-13)15-8-9-16-12/h13-14H,3-10H2,1-2H3
charge 0 multiplicity 1
40 atoms
S  -1.381882 1.273177 1.801596
S  -1.009672 1.9330 -1.21054
O  2.956505 -3.085067 1.089292
O  -3.888306 -2.850764 -0.894824
C  2.27419 0.520436 -0.318652
C  -0.411205 0.750147 0.206944
C  1.07957 1.010323 0.5794
C  -0.750256 -0.706916 -0.189733
C  2.541111 -1.021342 -0.244333
C  3.530558 1.274141 0.216055
C  2.091979 0.906446 -1.810253
C  -2.752338 2.230005 0.934318
C  -2.096241 3.070004 -0.162664
C  -2.247733 -1.050333 -0.317738
C  2.777144 -1.622176 1.154739
C  -2.461711 -2.508072 -0.765938
H  1.235456 0.591737 1.595819
H  1.178154 2.106132 0.692077
H  -0.252549 -0.921476 -1.157555
H  -0.286831 -1.377215 0.562637
H  3.442029 -1.22352 -0.864804
H  1.715152 -1.584244 -0.713966
H  4.449863 0.897483 -0.27126
H  3.651454 1.157365 1.30908
H  3.452222 2.356353 0.002802
H  1.258632 0.357676 -2.286525
H  1.883774 1.985061 -1.919707
H  3.013623 0.670837 -2.376549
H  -3.222716 2.862687 1.707377
H  -3.493677 1.526986 0.523113
H  -2.842287 3.50318 -0.852394
H  -1.472248 3.870224 0.266393
H  -2.75232 -0.897388 0.654379
H  -2.714174 -0.36346 -1.053957
H  1.896365 -1.498078 1.806167
H  3.647793 -1.149132 1.654649
H  -1.924648 -2.702165 -1.721101
H  -2.081763 -3.213699 -0.007489
H  3.725982 -3.283452 0.497169
H  -4.298598 -2.242501 -1.560822
