program: Gaussian 09
title: 000282936
version: EM64L-G09RevD.01
frameworkgroup: C1[X(C18H17NOS3)]
method: RPBEPBE
basis: SDD
operation: Freq
keyword: #p
keyword: freq=noraman
keyword: PBEPBE/SDD
title: #p freq=noraman PBEPBE/SDD
converged: YES YES NO NO
title: Mulliken charges:
elementType: S S S O N C C C C C C C C C C C C C C C C C C H H H H H H H H H H H H H H H H H
charge: -0.044799 0.164827 0.276448 -0.261256 0.043427 0.807012 0.328759 -0.465378 -0.925792 0.227166 -0.371956 -0.372716 0.343380 -0.396591 -0.269987 -0.240498 -0.227253 -0.331473 -0.388967 -0.240829 -0.245690 -0.683747 -0.826851 0.251031 0.255090 0.257084 0.233546 0.247136 0.251731 0.227462 0.228079 0.228570 0.210807 0.209774 0.208097 0.232991 0.233340 0.275528 0.258752 0.293748
chargesum: 0.00000
title: Mulliken charges with hydrogens summed into heavy atoms:
elementType: S S S O N C C C C C C C C C C C C C C C C C C
charge: -0.044799 0.164827 0.276448 -0.261256 0.043427 0.807012 0.328759 -0.465378 -0.925792 0.227166 -0.120925 -0.117627 0.343380 -0.139507 -0.036441 -0.013036 0.000827 -0.084337 -0.137236 -0.012259 0.174891 -0.009319 0.001177
polarizability: 4.95810390e+02 2.13248537e+01 2.98042975e+02 6.04282487e+00 6.24276308e+00 1.46369296e+02
1716.lowfreq: -6.4662 -0.0020 -0.0015 -0.0011 2.3790 6.3295 14.0777 27.3293 36.8990
frequency: 13.7100 27.3064 36.5088 42.1649 44.1791 59.6456 74.3396 83.9332 102.8989 116.4067 125.9418 133.5485 146.9610 167.0249 190.4614 210.4077 224.8312 242.2227 246.5281 268.7591 309.3830 323.5099 355.3376 365.1873 395.9431 404.6240 410.2195 411.1931 420.5474 483.4156 499.6279 531.4819 545.9942 554.7763 607.2877 613.4969 633.0918 642.1121 669.4241 687.4584 701.1318 724.6058 734.6047 773.1273 795.7493 796.3113 819.8473 824.0243 838.6647 848.7496 887.6343 902.6238 921.1343 934.1371 957.9023 971.4728 974.3852 988.6750 992.3001 992.7356 993.4631 1023.5039 1035.6981 1067.8795 1084.5041 1114.9118 1121.1492 1135.4362 1172.5051 1172.8543 1191.3191 1212.4664 1233.4216 1264.0795 1286.4177 1302.0748 1318.3603 1337.3290 1348.5654 1369.9083 1374.0292 1400.7601 1429.7983 1430.6848 1441.7418 1458.7471 1461.0978 1474.7420 1477.4835 1484.7934 1494.7097 1536.2775 1554.1717 1584.3124 1600.2649 1607.7679 1637.6877 2957.6318 2997.9657 3015.8513 3016.5722 3095.3527 3107.1490 3122.9505 3124.6433 3135.1971 3143.0710 3149.3638 3149.6441 3150.7590 3159.2672 3165.2182 3168.8419 3172.3891
redmass: 3.8261 4.5004 3.3786 5.4936 5.5142 3.9314 5.7055 6.2592 6.3867 1.7628 5.9534 3.5233 1.2050 5.4986 4.7458 5.8331 4.9256 2.0646 2.1003 8.8488 6.6461 15.9167 4.7085 7.4584 11.0737 2.8803 5.0335 4.3839 4.7691 4.6298 4.1121 9.1636 3.3004 6.1812 7.8513 6.5260 7.3113 7.3329 5.8889 7.5641 1.7445 3.5502 4.3370 2.5185 1.7813 2.5539 1.3601 6.1395 1.3096 1.2477 9.7590 3.4103 1.4361 1.3973 1.3521 1.3001 1.2399 4.2340 2.5552 1.2890 1.4503 2.7116 2.7930 3.1363 1.7767 1.9797 1.4454 1.4387 1.0724 1.2443 1.1182 3.1367 3.5421 1.1404 3.4683 1.4252 1.4099 1.1333 4.1882 1.3542 7.6787 1.2662 2.2999 4.0210 1.0539 1.0572 1.0398 1.6228 1.4695 1.3680 1.5148 9.2144 6.8504 6.1122 7.7356 6.1274 9.5458 1.0554 1.0363 1.0273 1.1076 1.0989 1.1014 1.0893 1.0847 1.0885 1.1045 1.1064 1.0938 1.0877 1.0961 1.0944 1.1008 1.0966
irintensity: 0.3955 0.4158 1.8173 0.1931 0.2722 0.1024 0.0621 0.2994 1.6222 2.3877 3.1477 0.8952 0.0790 1.8147 1.0552 1.1511 0.5537 1.1488 2.2604 8.1381 4.4426 2.0605 1.0914 0.4625 1.5046 0.1154 1.3239 0.0169 2.3005 3.8248 16.4651 28.3641 9.5486 19.5913 30.9280 0.2799 2.5308 8.1725 5.8271 18.9261 34.9838 1.2322 25.0164 64.9835 6.2725 11.8684 61.5125 3.8536 18.5467 0.3721 7.1621 63.1616 1.3348 1.1844 1.1681 3.0144 4.7542 3.5945 6.1553 13.4563 11.8013 3.7391 104.4956 41.1634 9.6831 1.0357 21.3450 4.5585 16.3454 133.1465 2.2402 119.1211 312.4735 0.0146 24.2954 5.0065 0.7036 3.3889 0.1795 22.0897 0.1367 41.4078 10.8678 3.1748 12.7201 7.2811 12.0418 130.4615 11.5927 87.9715 45.0407 62.8650 24.9594 2.3095 27.7544 5.3095 255.0840 45.9382 34.5693 25.7380 34.9283 29.7111 33.9031 37.0338 0.2265 8.6717 6.2305 11.8618 26.9130 13.8386 20.4781 5.4607 11.1910 12.8885
temp: 298.150 k
press: 1.00000 atm
elementType: 16 16 16 8 7 6 6 6 6 6 6 6 6 6 6 6 6 6 6 6 6 6 6 1 1 1 1 1 1 1 1 1 1 1 1 1 1 1 1 1
symmnumber: 1
zpe: 788748.7 jmol-1
zpe.correction: 0.300419 hartree
zpe.thermalcorrener: 0.323763 hartree
zpe.thermalcorrenthalpy: 0.324707 hartree
zpe.thermalcorrgfe: 0.244242 hartree
zpe.sumelectzpe: -2018.602859 hartree
zpe.sumelectthermal: -2018.579515 hartree
zpe.sumelectthermalent: -2018.578571 hartree
zpe.sumelectthermalfe: -2018.659036 hartree
dipole: 1.1820 3.5936 1.6971
dipole: 4.1462
quadrupole: -125.5482 -150.2179 -156.1150
quadrupole: 3.3808 -3.6983 0.8880
quadrupole: 18.4121 -6.2575 -12.1546 3.3808 -3.6983 0.8880
hfenergy: -2018.9032776 hartree
pointgroup: C01 [X(C18H17N1O1S3)]
dipole: 0.2318552 -1.5723044 -0.3675562 debye
polarizability: 484.3811652|-51.3008163|305.9392726|0.491516|-24.3243094|149.9022229 unknown
InChI: InChI=1S/C18H17NOS3/c1-3-20-15-11-9-14(10-12-15)19-17-16(18(21-2)23-22-17)13-7-5-4-6-8-13/h4-12H,3H2,1-2H3
charge 0 multiplicity 1
40 atoms
S  -0.383468 3.376018 -0.479916
S  -2.579134 4.03455 -0.59605
S  -4.981169 2.318442 -0.212151
O  5.681126 0.16619 -0.076859
N  0.049085 0.598819 -0.003109
C  -2.282973 1.310806 -0.044069
C  -2.761438 -0.069559 0.279549
C  -0.825948 1.541585 -0.150662
C  -3.155011 2.361338 -0.236216
C  1.447796 0.566571 -0.029496
C  -2.392257 -1.171553 -0.536242
C  -3.592785 -0.296735 1.407493
C  4.282533 0.220447 -0.051022
C  2.038253 -0.72007 0.131642
C  2.325834 1.686816 -0.195395
C  -2.857782 -2.470494 -0.238248
C  -4.053147 -1.597935 1.70798
C  3.432176 -0.904014 0.120661
C  3.718087 1.512535 -0.206736
C  -3.691261 -2.688797 0.884139
C  6.32597 -1.152749 0.095247
C  7.832603 -0.918181 0.034937
C  -5.298057 1.286844 -1.771078
H  -1.733911 -1.007215 -1.39491
H  -3.868157 0.545156 2.050465
H  1.363825 -1.571082 0.268898
H  1.928479 2.702057 -0.306177
H  3.841124 -1.910332 0.247347
H  4.392439 2.365261 -0.330669
H  -2.568396 -3.310977 -0.879039
H  -4.688198 -1.759094 2.58618
H  -4.048865 -3.698113 1.11728
H  6.022892 -1.584637 1.071036
H  5.990692 -1.83364 -0.713916
H  8.370604 -1.875835 0.15684
H  8.119367 -0.476273 -0.934406
H  8.152289 -0.231991 0.837428
H  -4.835923 1.784287 -2.635853
H  -6.392273 1.248535 -1.887866
H  -4.888519 0.277121 -1.62504
