program: Gaussian 09
title: 000282697
version: EM64L-G09RevD.01
frameworkgroup: C1[X(C22H18O8)]
method: RPBEPBE
basis: SDD
operation: Freq
keyword: #pfreq=noraman
keyword: PBEPBE/SDD
title: #p freq=noraman PBEPBE/SDD
converged: YES YES NO NO
title: Mulliken charges:
elementType: O O O O O O O O C C C C C C C C C C C C C C C C C C C C C C H H H H H H H H H H H H H H H H H H
charge: -0.261841 -0.252864 -0.182829 -0.236173 -0.293448 -0.245803 -0.242489 -0.229020 0.163847 0.159514 0.385857 0.437295 -0.034145 0.198042 -0.071985 0.170438 -0.479748 -0.348075 -0.341209 -0.527888 -0.567494 0.234997 0.282448 -0.285704 -0.282641 0.038153 -0.203727 -0.538135 -0.554386 -0.505192 0.292892 0.269696 0.261934 0.285482 0.292279 0.293507 0.294724 0.245690 0.242470 0.229595 0.245892 0.221334 0.240439 0.223353 0.268480 0.216756 0.232299 0.257382
chargesum: 0.00000
title: Mulliken charges with hydrogens summed into heavy atoms:
elementType: O O O O O O O O C C C C C C C C C C C C C C C C C C C C C C
charge: -0.261841 -0.252864 -0.182829 -0.236173 -0.293448 -0.245803 -0.242489 -0.229020 0.163847 0.159514 0.385857 0.437295 -0.034145 0.198042 -0.071985 0.170438 -0.186857 -0.078379 -0.079275 -0.242405 -0.275215 0.234997 0.282448 0.007803 0.012083 0.038153 0.284433 0.158687 0.177886 0.201246
polarizability: 3.58949731e+02 1.37427647e+01 2.11402609e+02 -5.69086703e+00 2.85849625e+01 2.64961981e+02
1716.lowfreq: -8.0111 0.0002 0.0005 0.0007 2.5290 3.2364 8.8860 18.7310 33.0444
frequency: 7.3393 18.7040 33.0238 37.3927 45.3159 55.5953 63.7843 69.9526 77.6701 91.4933 109.6719 115.6529 118.9617 146.3059 151.7946 158.8239 175.4757 192.9281 204.0511 215.3566 221.2389 238.8456 256.1277 263.7007 268.6914 284.1299 295.4695 317.6390 339.1869 353.9312 359.9355 382.5233 402.7976 417.0687 418.5655 478.5091 505.2052 518.9253 544.4593 562.5408 569.0292 579.9156 582.7010 611.7347 642.1100 648.2525 664.6611 681.5194 711.1684 714.4056 741.1220 748.6066 766.5641 771.5953 784.4274 795.9944 811.1385 817.1356 829.2415 838.9992 854.4452 861.7657 870.2616 886.5424 912.2846 937.6963 949.3000 954.5205 969.0212 980.4439 1016.8552 1027.5206 1058.8844 1067.9547 1084.1887 1086.0130 1106.7985 1111.8905 1112.0885 1114.8464 1122.9860 1139.2391 1146.1804 1156.7035 1160.2511 1166.3782 1194.8128 1209.0204 1225.0528 1236.2064 1257.6431 1264.4993 1289.4138 1317.8387 1347.6926 1364.0210 1388.0063 1389.5002 1415.5801 1426.2227 1444.3854 1447.4456 1451.9171 1453.1697 1466.8420 1468.8841 1469.3674 1470.6711 1471.5787 1478.5901 1486.5446 1488.2988 1504.4820 1519.6524 1525.1049 1550.1478 1582.8311 1590.8494 1603.9705 1622.0086 2963.1469 2967.5109 2987.5064 3017.0814 3052.5236 3063.1736 3099.5660 3106.5517 3126.4982 3127.8257 3135.1443 3162.0866 3170.6378 3179.8666 3182.7479 3188.2754 3266.7124 3273.6618
redmass: 6.8016 5.0302 4.4991 4.4198 3.0647 3.9803 2.7312 3.3781 6.1798 2.9362 5.2753 4.6099 8.2350 2.5961 4.0539 3.6985 4.4233 4.4164 1.7455 3.5523 5.7612 2.6401 1.9747 3.1559 6.7344 3.9259 2.0835 8.1104 5.6783 4.4808 8.2749 7.3675 5.9627 4.8630 3.9049 6.3434 6.6021 7.3706 5.7147 6.3742 5.2052 5.1153 5.3250 4.2783 7.1866 4.7392 4.4041 9.4923 4.6858 4.8647 2.1575 3.6434 4.5243 6.0262 6.4714 2.8934 1.6199 4.0144 1.7030 10.1589 1.4507 5.1439 6.4239 1.6816 1.4570 5.4470 1.3367 8.6487 8.0664 4.6314 4.5496 2.8010 3.4355 1.4656 9.6267 6.8749 1.2357 1.5438 1.7772 1.3380 1.0553 1.5970 1.3789 1.4619 1.4500 1.9429 1.3447 2.7853 2.1146 1.9240 2.9131 1.6334 2.3801 5.4142 8.6694 1.3188 4.3973 4.0694 2.3480 1.5251 1.2027 1.5125 1.1010 4.3026 1.0524 1.3039 1.1258 1.7092 1.1798 1.2420 1.2628 1.7429 5.6627 9.8335 10.7590 8.0351 8.4128 5.9156 8.1235 8.0572 1.0329 1.0325 1.0330 1.0559 1.1038 1.1047 1.0987 1.1163 1.1007 1.0999 1.1057 1.0894 1.0904 1.0903 1.0932 1.0965 1.0974 1.1035
irintensity: 0.0558 0.4653 6.4063 1.1623 1.5205 5.1559 15.5210 0.3984 1.4599 1.6835 3.7933 1.5706 14.1336 5.5144 4.7300 3.5514 3.5346 8.4647 0.1903 1.8214 0.5993 1.1565 1.5148 1.3977 2.2615 3.5324 0.9219 0.0449 4.2224 1.8103 2.5104 7.6507 5.0077 6.4860 2.3103 2.0305 3.7750 1.2380 12.6347 0.6571 4.2944 1.3668 11.6977 5.1126 20.4297 13.1700 7.0628 0.8292 4.8428 25.8628 6.7809 90.6413 16.7069 34.0786 47.9827 2.7096 26.2773 60.1664 38.0586 10.5958 18.0532 14.0660 1.6741 34.3405 25.5053 32.4299 0.7906 39.6818 58.6587 58.4915 43.0847 9.4839 35.4444 4.9771 43.5807 232.0277 10.4359 8.4919 13.1810 3.8025 1.3993 29.9834 7.7178 45.5249 35.0804 35.8579 14.9244 55.8318 12.3789 90.8345 163.9012 82.1324 161.2439 400.0167 133.6931 3.0996 32.6663 91.7667 59.6371 9.5053 6.7557 36.8528 23.2164 91.8027 13.5399 65.6695 9.3917 128.9764 54.8449 101.9029 25.6200 88.1212 142.9390 271.9205 34.9895 132.5274 64.2587 18.2193 0.6944 28.4109 56.2371 43.7299 70.8202 106.2491 41.2644 22.3215 43.1414 26.7950 21.2620 22.9635 14.5440 1.7083 3.7088 0.7128 2.6325 2.9978 5.2358 2.5323
temp: 298.150 k
press: 1.00000 atm
elementType: 8 8 8 8 8 8 8 8 6 6 6 6 6 6 6 6 6 6 6 6 6 6 6 6 6 6 6 6 6 6 1 1 1 1 1 1 1 1 1 1 1 1 1 1 1 1 1 1
symmnumber: 1
zpe: 928164.2 jmol-1
zpe.correction: 0.353519 hartree
zpe.thermalcorrener: 0.381452 hartree
zpe.thermalcorrenthalpy: 0.382397 hartree
zpe.thermalcorrgfe: 0.291867 hartree
zpe.sumelectzpe: -1448.680954 hartree
zpe.sumelectthermal: -1448.653020 hartree
zpe.sumelectthermalent: -1448.652076 hartree
zpe.sumelectthermalfe: -1448.742606 hartree
dipole: 1.8675 1.8343 -0.8729
dipole: 2.7594
quadrupole: -159.4246 -169.1651 -170.5108
quadrupole: 12.4207 3.0773 7.2210
quadrupole: 6.9422 -2.7982 -4.1440 12.4207 3.0773 7.2210
hfenergy: -1449.0344727 hartree
pointgroup: C01 [X(C22H18O8)]
dipole: 0.5645975 -0.5081984 0.7755938 debye
polarizability: 208.89191|29.1789715|274.2176299|-12.5909479|-21.4276456|352.2047806 unknown
InChI: InChI=1S/C22H18O8/c1-25-18-7-13(8-19(26-2)22(18)27-3)21(24)15-10-28-9-14(15)20(23)12-4-5-16-17(6-12)30-11-29-16/h4-10H,11H2,1-3H3
charge 0 multiplicity 1
48 atoms
O  2.218801 -2.018909 2.471663
O  3.114214 0.139775 3.021819
O  0.773382 1.673138 -5.100877
O  -2.879845 1.187645 2.610114
O  -3.021295 -2.108615 -0.866041
O  -3.612533 -1.203348 1.774691
O  0.913008 -1.860929 -2.608993
O  -0.568884 3.477594 -1.431071
C  0.786839 0.467642 -3.155798
C  0.049425 1.71637 -2.928215
C  1.62614 -0.361605 -0.858922
C  -1.422888 1.294361 -0.851504
C  1.094656 -0.659584 -2.219824
C  2.121968 -1.144415 1.360417
C  -0.647081 2.234605 -1.706085
C  2.65519 0.125877 1.690907
C  1.61255 -1.424349 0.100475
C  2.171001 0.908134 -0.522874
C  2.703347 1.171382 0.76421
C  -1.829389 0.018279 -1.312443
C  -1.782049 1.722287 0.45111
C  -2.501772 0.865442 1.304041
C  -2.556024 -0.845635 -0.466365
C  1.189297 0.485647 -4.48215
C  0.081486 2.409312 -4.128984
C  -2.881003 -0.448712 0.868247
C  2.753367 -1.195643 3.584869
C  -2.551548 2.537105 3.080939
C  -2.655706 -2.570338 -2.214713
C  -3.372043 -2.658639 1.89058
H  1.213689 -2.402904 -0.177243
H  2.197762 1.702577 -1.273952
H  3.12731 2.144097 1.023177
H  -1.61378 -0.282049 -2.339692
H  -1.467887 2.722262 0.761461
H  1.763936 -0.202943 -5.093449
H  -0.33249 3.361568 -4.444711
H  3.664279 -1.670767 3.982246
H  1.966537 -1.056112 4.347271
H  -3.026874 3.310102 2.447173
H  -2.958988 2.587203 4.101089
H  -1.45666 2.701356 3.104859
H  -3.073453 -3.585255 -2.286777
H  -3.114012 -1.925886 -2.989238
H  -1.558325 -2.600624 -2.34922
H  -2.290368 -2.862989 1.996667
H  -3.903567 -2.946393 2.81029
H  -3.76802 -3.196123 1.016126
