program: Gaussian 09
title: 000282644
version: EM64L-G09RevD.01
frameworkgroup: C1[X(C13H6Br2ClNO)]
method: RPBEPBE
basis: SDD
operation: Freq
keyword: #p
keyword: freq=noraman
keyword: PBEPBE/SDD
title: #p freq=noraman PBEPBE/SDD
converged: YES YES NO YES
title: Mulliken charges:
elementType: Br Br Cl O N C C C C C C C C C C C C C H H H H H H
charge: 0.048862 0.033959 -0.043924 -0.247105 -0.450323 0.430052 0.353122 0.311165 0.093562 -0.011057 -0.313337 -0.354936 -0.363918 -0.276555 -0.232707 -0.198547 -0.231390 -0.242601 0.345449 0.255549 0.258600 0.297219 0.284069 0.254792
chargesum: 0.00000
title: Mulliken charges with hydrogens summed into heavy atoms:
elementType: Br Br Cl O N C C C C C C C C C C C C C
charge: 0.048862 0.033959 -0.043924 -0.247105 -0.104874 0.430052 0.353122 0.311165 0.093562 -0.011057 -0.313337 -0.099387 -0.105318 0.020664 0.051361 0.056245 -0.231390 -0.242601
polarizability: 3.82004229e+02 -1.45411467e+00 2.00168199e+02 9.30216526e-04 -9.67461888e-03 6.56087907e+01
1716.lowfreq: -3.7450 -1.8668 -0.0010 0.0005 0.0013 3.7185 14.5392 35.4861 90.4669
frequency: 14.5361 35.4834 90.4660 90.6432 146.1280 149.8733 151.9963 168.3466 203.9768 221.4184 254.1976 283.3259 328.9702 341.6450 374.1696 407.7875 428.1598 474.2937 493.3004 509.7969 522.9080 552.9071 577.4362 611.7420 658.4227 673.5498 695.9626 716.7253 748.8149 768.7704 791.0619 808.2260 835.0106 853.9943 865.0814 934.5344 942.4523 972.5353 982.9464 1081.8215 1095.2504 1115.7272 1154.0761 1185.9130 1247.3176 1253.3597 1289.1785 1291.8716 1351.1183 1375.6185 1385.6981 1396.1310 1442.0365 1449.9862 1480.3430 1540.0827 1565.4726 1587.7350 1602.4491 1633.0943 3157.9813 3165.8733 3166.9886 3194.2613 3234.1171 3513.5927
redmass: 14.1507 8.0425 20.3601 8.9612 6.0492 6.5154 15.4647 33.1943 24.3559 5.9517 4.9667 18.7165 6.6788 11.0987 5.4621 7.9848 4.0772 8.0972 8.1875 4.3638 7.5890 4.1636 3.6462 6.0003 2.4786 7.7623 7.9696 2.2580 2.7023 8.3375 3.1546 7.2226 1.7353 1.4216 1.5795 6.9972 1.4375 1.3728 7.2419 2.0346 5.7155 1.8417 2.2866 1.6706 1.8657 1.8512 2.9055 1.8854 2.8541 5.3239 5.6275 4.2927 5.5152 2.2564 2.9395 7.9615 7.6415 7.2501 6.9345 5.2415 1.0931 1.0924 1.0926 1.0933 1.0913 1.0765
irintensity: 1.0923 1.0579 0.0442 1.4982 0.0001 1.0805 0.3120 0.2789 0.0098 0.0684 2.9258 5.3210 0.6308 20.9615 5.3281 2.0584 2.7343 7.4917 6.1101 9.1399 7.4577 0.4295 0.7883 19.4738 27.7370 36.0106 20.6403 5.1130 82.5457 44.4518 0.5261 17.3091 30.1582 23.6934 41.8964 72.9548 10.8328 1.1355 16.5046 3.6020 14.6517 27.5316 5.9224 21.9841 56.6150 22.4148 90.4972 9.9450 16.0537 94.5109 13.6837 25.0775 15.0982 143.9432 13.9295 46.1194 98.3108 28.3430 187.7135 386.3066 1.3645 1.6682 5.0675 2.2741 9.3032 42.4434
temp: 298.150 k
press: 1.00000 atm
elementType: 35 35 17 8 7 6 6 6 6 6 6 6 6 6 6 6 6 6 1 1 1 1 1 1
symmnumber: 1
zpe: 404569.2 jmol-1
zpe.correction: 0.154092 hartree
zpe.thermalcorrener: 0.169260 hartree
zpe.thermalcorrenthalpy: 0.170204 hartree
zpe.thermalcorrgfe: 0.108261 hartree
zpe.sumelectzpe: -1114.751635 hartree
zpe.sumelectthermal: -1114.736467 hartree
zpe.sumelectthermalent: -1114.735523 hartree
zpe.sumelectthermalfe: -1114.797466 hartree
dipole: -2.5307 1.5205 -0.0020
dipole: 2.9524
quadrupole: -132.4572 -130.2248 -132.2963
quadrupole: 11.9404 -0.0043 0.0016
quadrupole: -0.7977 1.4346 -0.6369 11.9404 -0.0043 0.0016
hfenergy: -1114.905727 hartree
pointgroup: C01 [X(C13H6Br2Cl1N1O1)]
dipole: -1.0229854 -0.550184 -0.0020677 debye
dipolederiv: -0.8660114 0.098725 -0.00026 0.1447238 -0.0627249 -0.0000993 -0.000011 -0.0001338 -0.0051118 -0.9528817 0.0613441 -0.0008069 0.0332114 -0.0417913 -0.0000591 -0.0009362 0.0000357 -0.0177421 -0.2035801 0.1181049 0.0003675 0.0657486 -0.6851922 -0.0024551 0.0001008 -0.0024137 -0.052947 -0.7721946 -0.3227609 -0.0013233 -0.4402392 -1.1967474 -0.0029156 -0.0017533 -0.0029849 -0.358486 -1.1645354 -0.6197977 -0.0027179 -0.1323024 -0.5580482 -0.0009262 -0.0009277 -0.0012862 -0.2934224 -0.0736675 0.0549807 0.0002334 -0.2484152 -0.4242199 -0.001858 -0.000675 -0.0016786 0.0251412 0.3476983 0.097773 0.0006238 -0.17205 0.0773033 -0.0000741 -0.0002445 0.0002211 0.029345 0.4052145 0.3764405 0.0014241 0.3530825 0.6239056 0.0020033 0.0013518 0.0019914 0.1151932 0.1020985 0.1325263 0.0005331 0.1731188 -0.4518516 -0.0012363 0.0005411 -0.0013307 0.0076789 1.4493337 0.4987851 0.0024611 0.1519574 1.3955444 0.0037501 0.0012371 0.0040918 0.1963509 0.5472911 -0.2479527 -0.0006146 0.2080326 1.0703507 0.0046761 0.0009849 0.0042319 -0.0534224 -0.2334242 0.05553 0.0000463 -0.0027393 -0.001519 0.0003667 -0.0000964 0.0005398 -0.1397755 -0.5779867 -0.2739916 -0.0012241 0.0265927 -0.0920414 0.0001826 -0.0000526 0.0000258 -0.1412728 -0.613788 0.0083316 -0.000591 0.2913538 -0.0024019 0.0004423 0.0002651 0.0001806 -0.0415026 -0.8293953 0.2264944 0.0003063 0.253455 -0.3582257 -0.0009152 0.0003628 -0.0009503 -0.0687879 -0.3374553 -0.0758584 -0.0004972 -0.023583 0.1053855 0.0004576 -0.000312 0.0004132 -0.0669707 1.5109601 -0.0972874 0.0007318 -0.4554704 0.3356924 0.0012762 -0.0007374 0.0015863 -0.1207267 1.6635543 -0.0852774 0.0017191 -0.228421 -0.0564804 0.0000111 0.0013297 0.000118 -0.1416639 0.1156515 -0.0009919 -0.0001392 -0.0095475 0.2034004 -0.0004178 -0.0002121 -0.0003347 0.3162419 0.1475689 -0.0300015 -0.0000637 0.0219071 0.0309116 -0.0003355 0.0000812 -0.0004246 0.1599224 0.088826 0.0036083 -0.0000365 0.0413575 -0.0396273 -0.0007327 0.0000988 -0.0007458 0.1734044 0.1237637 -0.0088775 -0.0000655 -0.0890005 0.0832455 -0.0003228 -0.0003264 -0.0002453 0.1546405 0.0699245 -0.0288087 -0.0001591 -0.0381152 0.0513692 -0.0004432 -0.0001349 -0.0004848 0.1700774 0.053035 0.0589617 0.0000524 0.0753424 -0.0062376 -0.0003751 0.0000663 -0.0004221 0.1538361 unknown
polarizability: 381.7310717|-7.188563|200.4395691|0.264175|0.4534698|65.6105784 unknown
InChI: InChI=1S/C13H6Br2ClNO/c14-6-1-2-8-9(3-6)13(18)17-11-5-7(15)4-10(16)12(8)11/h1-5,17H
charge 0 multiplicity 1
24 atoms
Br -5.562538 0.376936 -0.002965
Br 5.527184 -0.567704 0.003829
Cl -1.324932 -3.230796 -0.013783
O  1.50189 3.164978 0.011087
N  -0.53429 2.061551 0.006245
C  -0.78012 -0.391414 -0.002469
C  0.701188 -0.487132 -0.001393
C  -1.361378 0.932339 0.001737
C  1.481912 0.721211 0.003254
C  0.864455 2.069477 0.007108
C  -1.748414 -1.44617 -0.007038
C  1.440187 -1.710193 -0.004202
C  -2.76035 1.166338 0.00164
C  2.8988 0.701208 0.004674
C  -3.140634 -1.24271 -0.007278
C  2.845628 -1.735827 -0.00271
C  -3.634233 0.076398 -0.002819
C  3.571884 -0.523944 0.001681
H  -0.970184 2.989108 0.009123
H  0.924523 -2.667156 -0.007594
H  -3.140677 2.192136 0.005025
H  3.420855 1.662612 0.008203
H  -3.817413 -2.098818 -0.010928
H  3.370158 -2.695628 -0.004925
