program: Gaussian 09
title: 000282693
version: EM64L-G09RevD.01
frameworkgroup: C1[X(C20H24N6O4)]
method: RPBEPBE
basis: SDD
operation: Freq
keyword: #p
keyword: freq=noraman
keyword: PBEPBE/SDD
title: #p freq=noraman PBEPBE/SDD
converged: YES YES NO NO
title: Mulliken charges:
elementType: O O O O N N N N N N C C C C C C C C C C C C C C C C C C C C H H H H H H H H H H H H H H H H H H H H H H H H
charge: -0.296464 -0.328359 -0.272632 -0.219212 -0.130341 -0.394280 -0.042860 -0.033867 -0.667421 -0.442355 -0.572232 0.172500 -0.465892 -0.079296 0.075260 0.468901 0.365664 -0.655286 -0.540892 0.246782 -0.327468 -0.374486 -0.363589 -0.376441 0.244550 0.159285 0.255215 -0.253278 -0.501676 -0.662595 0.232229 0.250983 0.223016 0.227742 0.327442 0.231765 0.225614 0.243641 0.222684 0.226769 0.239132 0.264818 0.263130 0.307348 0.346560 0.336058 0.219747 0.234967 0.237251 0.226438 0.238718 0.213252 0.250919 0.222544
chargesum: 0.00000
title: Mulliken charges with hydrogens summed into heavy atoms:
elementType: O O O O N N N N N N C C C C C C C C C C C C C C C C C C C C
charge: -0.296464 -0.328359 -0.272632 -0.219212 -0.130341 -0.066838 -0.042860 -0.033867 -0.013512 -0.106297 -0.089020 0.172500 -0.015134 -0.079296 0.075260 0.468901 0.365664 0.045734 -0.318208 0.246782 -0.100699 -0.135355 -0.098771 -0.113311 0.244550 0.159285 0.255215 0.201435 0.200731 0.024120
polarizability: 4.21022896e+02 9.40082719e+00 2.97172331e+02 -2.05619874e+01 -2.06632245e+01 2.31322655e+02
1716.lowfreq: -0.0008 -0.0005 0.0008 1.4819 1.8527 4.6610 11.2583 11.8325 19.9508
frequency: 8.6060 11.4222 19.9298 23.9085 32.2431 51.9841 54.9483 59.8210 68.0792 78.8139 80.8919 91.0225 97.1852 110.2306 124.6269 138.6990 160.5981 170.5568 186.1194 209.5899 214.7100 231.1107 234.6034 246.2826 262.0997 270.6637 283.2678 304.0000 320.8138 333.7887 345.3659 359.2108 406.3581 414.8576 419.9815 439.1381 462.6938 478.0062 481.5171 508.6173 516.9886 522.0159 524.8976 552.7083 570.5714 600.0831 612.1028 632.0769 632.6513 645.9755 655.7882 668.2255 670.1379 675.4123 696.0116 704.7659 728.6691 752.9845 756.3283 779.3317 799.9742 800.7020 810.4432 816.6039 832.6372 874.0506 880.4476 914.1390 925.3145 929.8596 971.4658 972.4681 981.6041 983.7155 998.6820 1006.8112 1030.9608 1046.1788 1065.9955 1068.7915 1093.8501 1098.0617 1110.0657 1112.8599 1113.1599 1128.7527 1134.1537 1144.8460 1156.7085 1195.0837 1201.8030 1207.6299 1220.9344 1224.4217 1242.9065 1268.9026 1270.1046 1282.6060 1300.4439 1316.6628 1342.0950 1354.1658 1362.4926 1379.6110 1383.6433 1387.6983 1389.9958 1418.7754 1423.0284 1437.9436 1449.9889 1450.0886 1455.3165 1462.9370 1465.5028 1467.9329 1469.9500 1473.9473 1484.3448 1484.9767 1498.4151 1513.2669 1525.4044 1531.1773 1557.8620 1585.8836 1594.0106 1614.6131 1619.5696 1628.2264 1632.0653 1699.3230 2851.5179 2948.0795 2959.6012 2963.3714 2990.1143 2990.1458 2997.9649 3024.3056 3030.1243 3085.3689 3088.1280 3096.7590 3100.8808 3114.3978 3138.4135 3139.1657 3145.4791 3154.0226 3170.3907 3177.3541 3522.7746 3552.3352 3552.6033 3689.3658
redmass: 5.8919 5.3688 4.4327 4.2578 4.9134 5.4798 3.7810 4.0231 3.6364 3.0945 2.8986 2.5619 1.4480 4.6536 4.4113 3.6271 2.5195 4.7564 1.5292 1.9477 4.1032 5.0887 2.7741 3.8017 5.8434 2.4894 4.9354 3.8666 3.7828 5.0316 4.4954 3.2519 1.2880 3.5665 3.0120 4.0677 2.6276 3.3101 3.7185 3.5768 3.6857 4.4369 4.1034 2.7135 1.9895 1.6626 4.7230 1.3124 6.6092 5.0080 2.2319 4.8521 5.2113 3.9773 5.6497 4.8449 5.0820 4.6108 2.9999 5.8616 1.3792 2.7338 1.3079 3.3781 1.8390 4.1916 3.3238 2.7026 7.4859 5.3027 1.3628 3.1248 1.3479 2.6640 3.2179 2.0604 2.6087 3.1978 4.7581 2.2914 2.2190 2.3161 1.5062 1.7100 1.2927 2.7941 1.4505 1.4550 1.7333 1.1887 2.1490 1.2301 1.7801 1.6294 3.9455 1.9615 2.6387 1.1083 1.8955 1.3832 1.7477 1.2577 2.3477 3.5028 3.1569 1.6758 2.3235 2.9153 1.1925 1.6241 1.0826 1.8231 1.0894 1.0629 1.0534 2.2877 1.1215 1.0934 1.1812 1.3583 1.1366 2.9602 2.8378 2.1021 7.0829 2.1787 4.2072 8.3698 2.8336 3.7987 6.5823 8.8417 1.0726 1.0602 1.0388 1.0840 1.0380 1.0959 1.0296 1.0596 1.1015 1.0978 1.1031 1.1041 1.0966 1.1053 1.0922 1.1043 1.0883 1.0870 1.0945 1.0963 1.0470 1.0767 1.0759 1.1017
irintensity: 0.3189 0.6677 0.2777 0.5240 2.0013 1.9739 1.7315 2.3229 0.5518 1.0407 0.9821 2.4485 0.3075 3.9621 4.0659 2.0802 8.9487 6.9460 5.5490 1.6719 1.3429 1.8291 1.1068 5.2202 7.8735 0.0944 3.3167 18.1544 18.9224 4.8684 12.3334 7.0101 125.0051 0.7305 0.3207 1.8159 0.9162 7.7596 6.7634 10.6802 1.8028 11.4637 5.5005 13.5910 16.5025 115.3859 2.9888 87.3550 6.3531 19.1405 9.5271 2.0072 1.6007 31.0433 21.9790 38.7171 4.4080 16.0292 12.9887 14.1906 6.8090 82.8499 4.2788 4.4925 67.5370 1.7114 14.4005 46.5224 19.7663 43.7016 2.2962 37.6534 1.2467 27.5393 20.9740 10.6063 91.8604 419.8913 253.7457 43.6313 90.6705 0.8944 18.5216 26.6581 2.6152 349.1679 25.4722 91.8609 2.2540 218.7785 22.8048 11.6717 49.1869 35.5178 65.6853 76.3931 230.6676 4.7934 73.6430 5.7518 59.4861 19.1907 38.7695 118.3183 33.4707 117.3851 67.1842 74.1938 72.1168 13.8023 12.6074 3.7440 25.0970 11.5688 14.0039 199.6197 16.7333 4.9904 17.8124 99.1121 27.8832 574.4169 192.2683 244.9924 6.6971 347.7805 168.1797 280.9182 522.5073 289.0203 168.7132 250.9054 127.9711 45.6663 92.9286 70.8322 22.2152 13.8387 58.5253 42.9965 42.3018 41.8149 4.0409 31.0000 22.0006 38.4621 15.5106 18.7937 1.2174 12.8819 17.8215 8.7469 84.3729 57.5258 29.6864 48.8645
temp: 298.150 k
press: 1.00000 atm
elementType: 8 8 8 8 7 7 7 7 7 7 6 6 6 6 6 6 6 6 6 6 6 6 6 6 6 6 6 6 6 6 1 1 1 1 1 1 1 1 1 1 1 1 1 1 1 1 1 1 1 1 1 1 1 1
symmnumber: 1
zpe: 1120038.4 jmol-1
zpe.correction: 0.426600 hartree
zpe.thermalcorrener: 0.456479 hartree
zpe.thermalcorrenthalpy: 0.457423 hartree
zpe.thermalcorrgfe: 0.360463 hartree
zpe.sumelectzpe: -1403.758608 hartree
zpe.sumelectthermal: -1403.728729 hartree
zpe.sumelectthermalent: -1403.727785 hartree
zpe.sumelectthermalfe: -1403.824745 hartree
dipole: 2.3851 2.3932 0.8123
dipole: 3.4751
quadrupole: -199.2947 -148.4648 -163.1824
quadrupole: -16.2070 15.1447 -2.4592
quadrupole: -28.9807 21.8492 7.1316 -16.2070 15.1447 -2.4592
hfenergy: -1404.185208 hartree
pointgroup: C01 [X(C20H24N6O4)]
dipole: 0.8954814 0.8533569 0.582336 debye
polarizability: 420.2219058|19.3043389|304.4582892|-13.7688711|-0.4239754|224.8376875 unknown
InChI: InChI=1S/C20H24N6O4/c1-4-30-20(28)25-16-9-15(21)17-18(24-16)22-10-13(23-17)11-26(2)14-7-5-12(6-8-14)19(27)29-3/h5-9,22,25H,4,10-11,21H2,1-3H3
charge 0 multiplicity 1
54 atoms
O  -5.750339 -2.692303 -2.002178
O  7.01389 -1.781373 -0.141446
O  -6.832468 -2.802912 0.062175
O  6.208806 0.212064 -1.119471
N  -2.775332 2.262799 0.857844
N  1.895408 2.242856 -0.922214
N  -0.181186 1.124534 0.632705
N  3.400198 0.551162 -0.304732
N  0.338382 -1.205185 2.066063
N  4.897828 -1.193467 0.31341
C  -1.789056 2.876606 -0.029433
C  -0.396631 2.251136 0.002955
C  0.701375 3.069802 -0.696125
C  1.11215 0.559354 0.61423
C  2.161205 1.101813 -0.182406
C  -3.519827 1.145683 0.46906
C  1.362127 -0.652824 1.327983
C  -2.78143 2.695263 2.263792
C  2.659124 -1.230055 1.226987
C  3.621032 -0.591243 0.402646
C  -3.375489 0.54905 -0.826998
C  -4.477999 0.564696 1.364237
C  -4.167397 -0.541037 -1.211753
C  -5.260482 -0.529243 0.969376
C  -5.12811 -1.099008 -0.32462
C  -5.981765 -2.249355 -0.684763
C  6.027016 -0.786368 -0.395737
C  8.341653 -1.530371 -0.762375
C  -6.573603 -3.842238 -2.429986
C  9.208158 -0.638184 0.132219
H  -1.692516 3.950882 0.236683
H  -2.16665 2.875694 -1.072825
H  0.927953 3.970553 -0.072301
H  0.319885 3.455116 -1.664928
H  2.661582 2.587505 -1.503626
H  -3.78545 3.040909 2.577981
H  -2.079367 3.534801 2.388953
H  -2.459726 1.881483 2.942985
H  2.902063 -2.153596 1.762761
H  -2.614956 0.913202 -1.5228
H  -4.616891 0.976802 2.367103
H  -4.040707 -0.985646 -2.203024
H  -5.994637 -0.963772 1.656602
H  0.439377 -2.09758 2.539159
H  -0.575063 -0.753308 2.009704
H  5.032548 -2.059836 0.838419
H  8.770901 -2.53874 -0.880095
H  8.185586 -1.067651 -1.753134
H  -6.370838 -4.720927 -1.793775
H  -6.274564 -4.031435 -3.471113
H  -7.647037 -3.595259 -2.363762
H  10.216582 -0.529975 -0.309408
H  8.76367 0.367044 0.225234
H  9.317018 -1.076916 1.139361
