program: Gaussian 09
title: 000282641
version: EM64L-G09RevD.01
frameworkgroup: C1[X(C15H11Cl2N3O)]
method: RPBEPBE
basis: SDD
operation: Freq
keyword: #p
keyword: freq=noraman
keyword: PBEPBE/SDD
title: #p freq=noraman PBEPBE/SDD
converged: YES YES NO NO
title: Mulliken charges:
elementType: Cl Cl O N N N C C C C C C C C C C C C C C C H H H H H H H H H H H
charge: -0.043409 -0.035962 -0.244903 -0.190656 -0.017864 0.061754 0.346751 0.292470 0.374400 0.455630 -0.541507 -0.031461 -0.433563 -0.388749 -0.562662 -0.349923 -0.387251 -0.293519 -0.246509 -0.112866 -0.584409 0.277317 0.244248 0.248399 0.261991 0.234925 0.288027 0.252758 0.290003 0.260148 0.278813 0.297579
chargesum: 0.00000
title: Mulliken charges with hydrogens summed into heavy atoms:
elementType: Cl Cl O N N N C C C C C C C C C C C C C C C
charge: -0.043409 -0.035962 -0.244903 -0.190656 -0.017864 0.061754 0.346751 0.292470 0.374400 0.455630 -0.264190 -0.031461 -0.189315 -0.140351 -0.300671 -0.114998 0.153533 -0.003516 0.013639 -0.112866 -0.008017
polarizability: 4.00488020e+02 6.06856284e+00 2.29175551e+02 -9.75658983e+00 -1.20707201e+00 8.64693063e+01
1716.lowfreq: -0.0024 -0.0021 -0.0013 3.6220 5.6111 13.5879 15.9291 35.4998 51.5540
frequency: 15.6608 35.4969 51.5136 67.3901 89.3170 97.7346 121.9078 157.1043 173.0894 187.8107 199.0121 230.0849 273.6721 301.7035 306.5552 311.2923 366.2845 386.1453 414.7839 431.8580 444.4272 463.8264 499.5594 510.7042 523.2015 527.8931 605.3539 611.7132 630.7376 644.7267 695.4286 712.0941 728.2335 733.5083 784.7659 786.0364 820.7464 822.4086 833.9093 855.6555 874.1073 890.8174 901.9732 913.7313 932.0710 959.9000 973.4972 1006.6648 1030.6306 1041.1075 1058.5488 1069.5686 1121.2269 1165.0431 1176.6693 1185.5855 1228.2459 1254.2104 1258.3876 1263.7160 1275.2038 1300.6055 1335.1734 1345.3973 1349.8059 1369.3191 1387.0144 1404.1562 1413.4490 1428.9599 1441.5569 1459.3671 1465.1539 1486.5220 1516.9631 1558.0494 1576.3535 1605.0483 1621.7324 3035.8855 3068.9917 3103.2421 3107.0465 3136.0384 3147.9906 3155.6226 3170.1823 3176.3460 3185.6139 3196.3365
redmass: 13.7367 14.1197 6.4411 5.8903 7.4101 3.4214 4.4978 5.9769 6.7629 6.4775 10.1110 7.5786 9.8434 5.3893 5.8400 6.7952 4.7083 4.8671 4.9243 3.1398 4.0653 5.5947 7.4101 5.5855 2.9382 7.4509 7.2653 7.0704 3.4956 7.5280 6.8648 6.3978 3.3452 2.1100 1.9438 2.7207 1.5557 2.8111 1.9921 5.1661 4.9183 3.4544 1.5607 1.6640 1.4296 1.3445 1.4408 5.6078 1.5079 3.5561 2.9689 2.0885 2.4622 1.3346 1.7774 1.9932 1.6717 1.7530 1.5989 1.2375 1.7374 1.5696 1.7298 3.1785 3.1621 1.7263 3.3318 3.3487 3.4398 5.4312 3.7468 1.1112 1.1019 3.5109 4.1199 8.6977 6.9256 6.7881 6.8130 1.0608 1.0565 1.0912 1.1027 1.0893 1.0885 1.1117 1.0950 1.0963 1.0935 1.0907
irintensity: 0.0415 0.9928 1.9691 1.9825 1.3997 1.7948 0.5011 3.7390 2.1616 2.5562 1.6953 2.9273 4.3941 0.2352 0.5394 0.3197 0.9033 14.3714 4.6471 12.0361 10.2295 3.4349 11.1990 3.0016 0.0715 3.2797 0.5778 0.6600 18.9911 3.8259 71.9666 24.4024 1.0724 2.9220 20.8763 15.1749 22.2768 94.2680 47.8888 50.1434 9.6657 122.9331 11.1065 24.9978 25.4305 1.5813 6.4229 28.1003 24.3081 19.6034 54.9830 22.8360 12.7580 3.4367 2.2334 32.4154 2.0100 38.9310 2.5378 11.9535 10.4918 5.6882 50.3568 26.7143 130.1048 32.4594 21.6869 10.2137 5.3807 16.9164 44.4824 21.4118 31.4518 94.3795 10.7586 20.6832 16.5970 104.1680 84.5149 5.2085 14.8206 19.5220 2.2886 7.5604 3.5617 6.3766 13.7174 2.9416 0.8529 0.2116
temp: 298.150 k
press: 1.00000 atm
elementType: 17 17 8 7 7 7 6 6 6 6 6 6 6 6 6 6 6 6 6 6 6 1 1 1 1 1 1 1 1 1 1 1
symmnumber: 1
zpe: 601615.0 jmol-1
zpe.correction: 0.229143 hartree
zpe.thermalcorrener: 0.246998 hartree
zpe.thermalcorrenthalpy: 0.247942 hartree
zpe.thermalcorrgfe: 0.180856 hartree
zpe.sumelectzpe: -1736.288230 hartree
zpe.sumelectthermal: -1736.270376 hartree
zpe.sumelectthermalent: -1736.269431 hartree
zpe.sumelectthermalfe: -1736.336517 hartree
dipole: 1.8674 1.7639 -0.2796
dipole: 2.5839
quadrupole: -163.9445 -137.0803 -136.3862
quadrupole: 13.4119 -0.1527 0.3003
quadrupole: -18.1408 8.7234 9.4174 13.4119 -0.1527 0.3003
hfenergy: -1736.5173733 hartree
pointgroup: C01 [X(C15H11Cl2N3O1)]
dipole: -0.6937243 -0.7319011 -0.128529 debye
polarizability: 399.3816395|15.9991974|230.1572403|5.6617886|7.1885173|86.5939979 unknown
InChI: InChI=1S/C15H11Cl2N3O/c16-5-6-20(19-21)12-3-1-10-9-18-15-7-11(17)2-4-13(15)14(10)8-12/h1-4,7-9H,5-6H2
charge 0 multiplicity 1
32 atoms
Cl 6.385111 1.5594 0.126151
Cl -6.830747 -0.750655 0.294988
O  -3.833636 2.868251 0.154698
N  -3.007708 0.788298 -0.142845
N  2.822634 -2.20808 -0.057219
N  -2.777303 2.147356 0.166643
C  0.580732 -0.357915 -0.068255
C  1.953514 0.145901 -0.019929
C  0.398647 -1.786215 -0.10731
C  -1.860242 -0.069973 -0.132412
C  -0.563435 0.483006 -0.087248
C  3.028917 -0.816491 -0.017896
C  -0.918388 -2.32446 -0.155036
C  -2.038244 -1.489488 -0.162139
C  1.565547 -2.642707 -0.098862
C  2.288367 1.531493 0.026511
C  -4.378335 0.324253 -0.464937
C  4.38513 -0.378617 0.026612
C  3.622201 1.959668 0.07042
C  4.657286 0.988354 0.068942
C  -5.148547 -0.074333 0.805905
H  -0.461149 1.56867 -0.070783
H  -1.048895 -3.412399 -0.180369
H  -3.038333 -1.930997 -0.185336
H  1.42331 -3.731504 -0.128427
H  1.500696 2.291163 0.03083
H  -4.899227 1.166951 -0.952423
H  -4.319297 -0.515391 -1.174419
H  5.172558 -1.135931 0.026528
H  3.867951 3.02457 0.106331
H  -4.658069 -0.880794 1.370174
H  -5.348542 0.791813 1.451613
