program: Gaussian 09
title: 000282640
version: EM64L-G09RevD.01
frameworkgroup: C1[X(C15H12ClN3O2)]
method: RPBEPBE
basis: SDD
operation: Freq
keyword: #p
keyword: freq=noraman
keyword: PBEPBE/SDD
title: #p freq=noraman PBEPBE/SDD
converged: YES YES NO NO
title: Mulliken charges:
elementType: Cl O O N N N C C C C C C C C C C C C C C C H H H H H H H H H H H H
charge: -0.042222 -0.447910 -0.234501 -0.188479 -0.212159 0.051723 0.320424 0.206961 0.292996 0.106528 0.016510 -0.368570 -0.332133 -0.440627 -0.297736 -0.309702 -0.239591 -0.260285 -0.166010 -0.235182 -0.286755 0.230129 0.266820 0.241643 0.250448 0.249528 0.279714 0.238927 0.241187 0.265471 0.198707 0.211438 0.392709
chargesum: 0.00000
title: Mulliken charges with hydrogens summed into heavy atoms:
elementType: Cl O O N N N C C C C C C C C C C C C C C C
charge: -0.042222 -0.055202 -0.234501 -0.188479 -0.212159 0.051723 0.320424 0.206961 0.292996 0.106528 0.016510 -0.138441 -0.065313 0.051464 -0.048208 -0.029988 -0.000663 -0.019099 -0.166010 0.030289 0.123390
polarizability: 3.39155917e+02 -2.39268516e+01 2.57811238e+02 2.05965499e+00 -2.58791429e+00 8.77209782e+01
1716.lowfreq: -7.2903 -4.4722 0.0012 0.0022 0.0023 4.2112 28.4167 44.3262 74.2468
frequency: 28.3255 44.3159 74.2428 75.2148 101.2495 105.7774 147.2570 160.6816 174.3569 213.8844 236.2848 243.5238 256.8499 302.8621 326.5721 340.6390 376.7591 385.9214 422.2497 426.0939 448.3178 453.6247 490.0287 511.8287 519.0399 586.3023 596.8183 621.1678 648.4717 662.6617 711.3454 725.4338 728.9253 740.6788 773.1664 777.2664 785.5851 820.2074 836.1031 856.7996 873.1321 875.7164 896.1970 959.9864 962.9103 967.4403 975.7188 998.1779 1006.2119 1047.7452 1055.5672 1079.6151 1082.1800 1106.7515 1145.0819 1161.4838 1188.0710 1209.0564 1235.8557 1252.6422 1278.6453 1299.1901 1308.4424 1331.8652 1341.5591 1360.9611 1367.0176 1387.0830 1397.0171 1420.1514 1424.0090 1430.0948 1440.0840 1474.6122 1478.5658 1512.2937 1525.2932 1556.8058 1574.8223 1606.4449 1619.4013 2947.4163 2987.3841 3020.3177 3044.7059 3094.4376 3139.8296 3156.4965 3156.7705 3169.8017 3177.7656 3181.2356 3197.9443
redmass: 9.0850 6.4429 4.9036 5.0728 7.1026 5.0012 4.4829 5.9308 6.5167 4.9365 7.3364 4.9525 6.0207 7.5700 5.8470 7.5361 5.8203 5.7479 3.0920 3.0140 7.0516 3.4729 4.9120 3.2575 3.8931 4.0436 5.6879 6.7955 7.7382 3.9792 4.5842 3.4666 6.6588 5.0083 1.4053 1.7259 1.7104 3.7856 1.5372 4.1163 1.9422 1.4090 4.1475 2.3638 2.0379 1.3441 3.2679 1.3571 6.2547 2.1837 3.3500 2.4356 2.4382 2.4563 1.4519 2.3840 1.1092 1.1144 1.7806 2.0723 1.3327 1.9618 1.8656 1.3547 2.3961 3.4888 2.3862 3.1738 4.1053 2.0461 2.4236 2.2076 3.1336 1.0868 2.8380 2.5925 1.4325 6.8717 7.6874 6.7427 6.2398 1.0642 1.0750 1.0607 1.0914 1.1044 1.0865 1.0912 1.0899 1.0974 1.0919 1.0971 1.0947
irintensity: 0.2819 0.9389 6.2443 1.0303 0.5367 4.5511 0.9572 1.5475 2.1198 0.8551 1.3699 0.4090 6.2091 3.9109 1.1510 2.7966 0.6385 2.1593 4.2426 5.4495 5.4329 1.2514 1.9991 3.9807 6.3742 15.1904 24.9576 2.9993 30.5776 9.1987 2.9357 9.2006 11.0950 78.9540 104.4594 14.8352 10.1922 24.0708 88.0784 60.3097 2.9335 8.6340 16.6118 151.4640 129.2941 1.0660 8.4361 0.3339 26.8359 4.9078 23.1610 54.8265 2.9642 4.6964 7.7794 15.5765 2.9825 1.4455 4.1296 9.1651 1.6537 6.7929 17.3409 104.0203 81.9841 163.5534 31.7245 1.0907 70.0299 20.7973 5.5109 23.2738 12.4834 1.6497 81.0581 1.8877 56.7807 53.3565 6.9700 32.6876 9.4110 398.1098 570.2742 7.9656 24.7614 3.5348 2.1171 11.6298 0.0769 12.6349 8.2702 1.7534 3.9264
temp: 298.150 k
press: 1.00000 atm
elementType: 17 8 8 7 7 7 6 6 6 6 6 6 6 6 6 6 6 6 6 6 6 1 1 1 1 1 1 1 1 1 1 1 1
symmnumber: 1
zpe: 635365.6 jmol-1
zpe.correction: 0.241998 hartree
zpe.thermalcorrener: 0.259477 hartree
zpe.thermalcorrenthalpy: 0.260421 hartree
zpe.thermalcorrgfe: 0.195769 hartree
zpe.sumelectzpe: -1352.040126 hartree
zpe.sumelectthermal: -1352.022647 hartree
zpe.sumelectthermalent: -1352.021703 hartree
zpe.sumelectthermalfe: -1352.086354 hartree
dipole: 1.9797 3.9393 2.0427
dipole: 4.8590
quadrupole: -140.5038 -121.7007 -132.0129
quadrupole: -1.0702 -8.3218 -0.5656
quadrupole: -9.0980 9.7051 -0.6071 -1.0702 -8.3218 -0.5656
hfenergy: -1352.2821237 hartree
pointgroup: C01 [X(C15H12Cl1N3O2)]
dipole: 0.9080448 1.5501825 0.6534077 debye
polarizability: 333.1034401|-30.2733489|260.1958547|12.9763711|-24.2258088|91.3888379 unknown
InChI: InChI=1S/C15H12ClN3O2/c16-10-5-6-14-13(9-10)11-3-1-2-4-12(11)15(17-14)19(18-21)7-8-20/h1-6,9,20H,7-8H2
charge 0 multiplicity 1
33 atoms
Cl 5.531563 -1.189668 0.327213
O  -2.045595 -3.226735 0.40306
O  -4.58478 0.465304 -0.720167
N  -2.587047 -0.066469 0.198657
N  -0.476245 -1.028738 0.346055
N  -3.336096 0.727572 -0.716162
C  0.914828 1.446835 0.031949
C  -0.531272 1.411643 0.046074
C  1.662821 0.198258 0.180637
C  -1.166678 0.101682 0.18625
C  0.916789 -1.016221 0.362162
C  1.56539 2.709418 -0.100201
C  -1.258962 2.639222 -0.030768
C  -3.258853 -1.126379 1.001603
C  3.086146 0.121957 0.171778
C  1.588633 -2.261981 0.537252
C  0.83065 3.897563 -0.191593
C  -0.589902 3.863209 -0.143544
C  3.712485 -1.115159 0.34242
C  2.98657 -2.320905 0.528709
C  -3.311664 -2.523759 0.32514
H  2.657545 2.759709 -0.120999
H  -2.349139 2.619503 -0.018999
H  -4.287552 -0.75906 1.168318
H  -2.724042 -1.20522 1.963458
H  3.699997 1.014683 0.03318
H  0.989203 -3.167433 0.672492
H  1.351445 4.855949 -0.289419
H  -1.1628 4.79426 -0.199862
H  3.513982 -3.269622 0.659255
H  -3.660684 -2.408454 -0.723466
H  -4.057483 -3.131993 0.869802
H  -1.319553 -2.511769 0.338215
