program: Gaussian 09
title: 000282638
version: EM64L-G09RevD.01
frameworkgroup: C1[X(C15H12ClN3O)]
method: RPBEPBE
basis: SDD
operation: Freq
keyword: #p
keyword: freq=noraman
keyword: PBEPBE/SDD
title: #p freq=noraman PBEPBE/SDD
converged: YES YES NO NO
title: Mulliken charges:
elementType: Cl O N N N C C C C C C C C C C C C C C C H H H H H H H H H H H H
charge: -0.038631 -0.249034 -0.190436 -0.017424 0.060212 0.341331 0.275499 0.377358 0.454932 -0.543729 -0.048931 -0.436186 -0.388842 -0.566423 -0.358675 -0.387478 -0.314133 -0.257531 -0.229102 -0.584336 0.276587 0.242748 0.246531 0.258813 0.228764 0.287321 0.252662 0.264334 0.232461 0.234981 0.298009 0.278349
chargesum: 0.00000
title: Mulliken charges with hydrogens summed into heavy atoms:
elementType: Cl O N N N C C C C C C C C C C C C C C C
charge: -0.038631 -0.249034 -0.190436 -0.017424 0.060212 0.341331 0.275499 0.377358 0.454932 -0.267142 -0.048931 -0.193438 -0.142311 -0.307609 -0.129911 0.152504 -0.049800 -0.025069 0.005879 -0.007979
polarizability: 3.57058367e+02 6.40236777e+00 2.24655672e+02 9.39290512e+00 2.72752814e+00 8.43746313e+01
1716.lowfreq: -7.1375 -5.3377 -0.0024 -0.0021 -0.0017 5.7743 16.6637 35.6010 55.9687
frequency: 16.5254 35.5843 55.9668 91.1464 105.3797 109.3162 123.3953 165.7045 192.1023 229.9731 246.0493 257.3578 304.1331 327.2658 381.9206 403.3668 428.2664 431.4482 432.8674 456.5943 509.3938 516.7768 520.5404 585.9926 600.7897 617.2042 632.3156 694.0803 706.4621 726.7833 734.3546 760.5079 775.1438 797.4882 818.2378 821.5071 838.3078 870.3015 886.8133 892.1832 914.4885 927.5415 966.9407 971.5753 998.1991 1006.8140 1029.4482 1033.5000 1041.5371 1060.8327 1102.7584 1158.9826 1171.2147 1176.9177 1195.7952 1231.5730 1252.6076 1259.5108 1262.2536 1281.6045 1302.4116 1334.9027 1346.0027 1361.4940 1369.6037 1388.7703 1411.9497 1414.9317 1434.4386 1453.5261 1459.7174 1464.8526 1492.7150 1518.2387 1565.4333 1575.3828 1615.7941 1622.1749 3035.4513 3069.9259 3099.2274 3108.1482 3132.4256 3134.0029 3144.6615 3156.3913 3159.6520 3164.8729 3174.0477 3195.5094
redmass: 9.4727 11.6905 5.9330 2.9574 4.3348 7.2065 4.0353 5.7129 7.9017 7.7177 4.1300 7.0259 6.0835 4.5626 5.2669 4.1874 3.3834 5.3214 3.7644 5.4248 5.6913 3.0622 7.5752 3.9127 7.4891 6.8625 3.5873 6.7258 6.0407 2.8097 3.4064 2.2919 1.3655 2.0485 2.6307 1.6386 5.8003 4.7538 1.7485 3.2377 1.6673 1.4180 1.3848 1.4407 1.3347 5.6410 1.5078 1.9844 3.7771 3.6313 2.1663 1.3533 1.2014 1.5613 2.2916 1.7907 1.7298 1.5408 1.3828 1.4953 1.7362 1.7372 4.1566 2.1364 2.0550 2.6950 3.5978 3.4760 4.1337 2.8776 1.1146 1.0992 3.2529 4.3123 7.0822 7.1174 6.1092 6.9367 1.0609 1.0564 1.0911 1.1025 1.0854 1.0888 1.0899 1.1116 1.0954 1.0956 1.0997 1.0908
irintensity: 0.1427 0.8193 2.7304 0.8829 3.4716 3.8728 0.1246 2.9203 3.3590 3.1041 1.2094 2.5438 0.4180 0.1188 15.2960 2.3840 5.7925 1.8482 4.4243 4.9469 5.2104 3.0906 0.8449 0.4161 2.8511 6.1952 10.1340 70.9992 15.8408 1.0123 1.9081 4.9401 97.9826 1.1060 56.0289 22.3611 47.2004 3.0369 1.8624 90.9151 25.8092 20.4797 0.6846 10.6753 0.1614 26.8607 26.0487 8.7833 16.2119 59.0806 10.4228 5.4586 0.0689 8.5728 4.2860 4.8867 33.1147 1.6908 13.3473 8.3553 1.0580 37.4462 165.0075 8.9491 22.6611 20.3405 6.4514 0.7350 13.8104 27.7906 15.5434 28.5616 45.0509 19.5922 4.7117 12.3228 45.4901 45.1257 5.2582 14.5447 21.5701 2.2813 0.2059 7.9613 10.2607 6.7221 18.2045 14.4173 25.2343 0.3119
temp: 298.150 k
press: 1.00000 atm
elementType: 17 8 7 7 7 6 6 6 6 6 6 6 6 6 6 6 6 6 6 6 1 1 1 1 1 1 1 1 1 1 1 1
symmnumber: 1
zpe: 627144.1 jmol-1
zpe.correction: 0.238867 hartree
zpe.thermalcorrener: 0.255378 hartree
zpe.thermalcorrenthalpy: 0.256322 hartree
zpe.thermalcorrgfe: 0.192682 hartree
zpe.sumelectzpe: -1276.898948 hartree
zpe.sumelectthermal: -1276.882437 hartree
zpe.sumelectthermalent: -1276.881492 hartree
zpe.sumelectthermalfe: -1276.945133 hartree
dipole: 0.6986 -1.1309 -0.2308
dipole: 1.3491
quadrupole: -134.4238 -123.9066 -124.9625
quadrupole: 16.5900 0.3489 -0.4466
quadrupole: -6.6595 3.8577 2.8018 16.5900 0.3489 -0.4466
hfenergy: -1277.1378146 hartree
pointgroup: C01 [X(C15H12Cl1N3O1)]
dipole: 0.2853876 -0.4322933 -0.1158454 debye
polarizability: 356.821695|9.6703328|224.4766978|6.1921912|9.7113708|84.7902777 unknown
InChI: InChI=1S/C15H12ClN3O/c16-7-8-19(18-20)12-6-5-11-10-17-15-4-2-1-3-13(15)14(11)9-12/h1-6,9-10H,7-8H2
charge 0 multiplicity 1
32 atoms
Cl -6.488653 -0.996121 0.170587
O  -3.667758 2.748491 0.226026
N  -2.728804 0.725296 -0.118548
N  3.244734 -1.974207 -0.0469
N  -2.575483 2.080887 0.241904
C  0.913047 -0.241647 -0.040462
C  2.258694 0.332029 0.021476
C  0.802969 -1.676434 -0.100738
C  -1.539295 -0.075307 -0.1136
C  -0.272341 0.540857 -0.054324
C  3.382331 -0.573973 0.013658
C  -0.485561 -2.278957 -0.162611
C  -1.646069 -1.501071 -0.163717
C  2.012229 -2.472939 -0.099737
C  2.51975 1.732537 0.090592
C  -4.06615 0.205768 -0.492067
C  4.710861 -0.06057 0.070392
C  3.833596 2.219747 0.146309
C  4.938256 1.319984 0.135457
C  -4.857035 -0.250066 0.746288
H  -0.223602 1.629988 -0.023938
H  -0.561399 -3.371705 -0.203495
H  -2.622668 -1.992072 -0.197394
H  1.924649 -3.567115 -0.145401
H  1.689923 2.446689 0.103558
H  -4.61023 1.032369 -0.981998
H  -3.94501 -0.617775 -1.212268
H  5.530887 -0.784896 0.061532
H  4.010916 3.29935 0.199313
H  5.96099 1.709279 0.178913
H  -5.118912 0.594688 1.398201
H  -4.347265 -1.042106 1.313892
