program: Gaussian 09
title: 000282637
version: EM64L-G09RevD.01
frameworkgroup: C1[X(C15H13N3O2)]
method: RPBEPBE
basis: SDD
operation: Freq
keyword: #p
keyword: freq=noraman
keyword: PBEPBE/SDD
title: #p freq=noraman PBEPBE/SDD
converged: NO YES NO NO
title: Mulliken charges:
elementType: O O N N N C C C C C C C C C C C C C C C H H H H H H H H H H H H H
charge: -0.448541 -0.238600 -0.186682 -0.217980 0.050028 0.324557 0.203971 0.263497 0.105137 0.023522 -0.376922 -0.333263 -0.441286 -0.361600 -0.321392 -0.238372 -0.262894 -0.258633 -0.230788 -0.286711 0.228806 0.265940 0.240597 0.249924 0.223884 0.274110 0.236276 0.239266 0.233985 0.238880 0.198102 0.209647 0.393535
chargesum: 0.00000
title: Mulliken charges with hydrogens summed into heavy atoms:
elementType: O O N N N C C C C C C C C C C C C C C C
charge: -0.055006 -0.238600 -0.186682 -0.217980 0.050028 0.324557 0.203971 0.263497 0.105137 0.023522 -0.148116 -0.067323 0.049235 -0.137716 -0.047282 -0.002096 -0.023628 -0.024648 0.008092 0.121039
polarizability: 2.79582105e+02 -2.72525655e+01 2.69003689e+02 -4.41327902e-01 -1.59334435e+00 8.52841107e+01
1716.lowfreq: -9.0941 -0.0003 0.0003 0.0006 4.1456 6.7202 32.0042 56.8820 76.2599
frequency: 31.9891 56.8804 76.2515 93.9408 105.7464 119.9661 154.8716 207.2469 226.5620 238.6424 244.2236 290.2639 314.7081 337.7445 357.8785 410.8685 421.3740 426.7485 450.9689 473.3709 514.8135 518.4142 563.1063 590.0428 598.7234 614.2467 662.3860 707.4163 712.8412 728.6497 740.6436 765.4644 776.0326 790.2747 795.4739 810.0304 856.4898 874.2358 880.8771 896.5152 958.8018 963.8053 965.2099 976.7221 992.8993 994.8744 998.0313 1038.8051 1047.8828 1056.2681 1082.9464 1101.7862 1141.5892 1160.5997 1178.3888 1187.7125 1210.9207 1241.2780 1256.2393 1289.7135 1307.2797 1314.8129 1334.9857 1341.6534 1360.3376 1374.8886 1387.7872 1399.4386 1422.8126 1426.2164 1438.5255 1454.2295 1474.3021 1481.6268 1516.1242 1529.6062 1563.6034 1577.0702 1615.7820 1621.0066 2941.3967 2976.3649 3019.7349 3043.2300 3095.4073 3135.6782 3138.6260 3147.3326 3155.4235 3160.2626 3170.4821 3173.7202 3197.2243
redmass: 7.9963 4.3484 5.2524 4.9635 4.0353 5.9519 3.8740 4.6943 4.9612 5.5600 5.3261 4.4871 7.5232 5.1484 7.7962 5.6057 2.9710 3.1552 3.4970 4.6895 3.4541 3.2853 3.4308 7.9057 5.8358 6.7253 3.8844 5.6047 4.6507 2.6422 5.2155 1.4398 1.5676 2.3631 1.3586 3.3800 3.6556 1.5613 1.6730 4.2271 1.4650 1.9064 2.3626 3.1665 6.7095 1.3715 1.3405 2.0375 2.3853 3.3553 2.4256 2.6911 1.6831 2.2941 1.0789 1.1279 1.1169 1.7874 1.7645 1.4124 2.1203 2.1318 1.4086 2.4008 3.1414 2.0565 3.2190 5.4791 1.6039 1.9156 2.8888 2.7788 1.0875 2.6977 2.3129 1.4912 6.4782 7.4800 5.9133 6.4841 1.0647 1.0741 1.0614 1.0917 1.1040 1.0856 1.0863 1.0894 1.0919 1.0946 1.0982 1.0992 1.0947
irintensity: 0.4241 1.0794 7.0991 0.2931 1.5590 2.7537 2.1069 0.4504 3.4674 2.8616 2.5774 2.4502 1.5329 1.5760 3.7120 1.6257 3.8710 4.6734 0.8851 0.7999 3.3470 4.9644 3.2791 5.0263 17.6008 4.1483 2.5887 2.4998 5.3060 35.8695 51.4273 7.7558 115.5935 10.3916 81.3460 90.2759 25.3546 0.0689 5.2565 26.0445 13.3810 86.3844 145.2841 9.5896 0.7253 0.4080 0.1255 4.3757 4.2103 25.6499 9.0726 9.6306 6.9464 19.2304 0.3384 3.4055 1.3798 13.1718 0.2814 3.6916 2.6561 19.7270 107.1329 88.4180 141.8134 29.0021 1.5190 56.2903 13.0609 11.2144 8.9389 21.0595 1.6548 32.6241 1.9838 50.8058 35.9851 8.6891 8.2774 5.2345 571.8654 407.2856 5.9391 25.4948 3.9016 0.4207 3.7369 7.8948 7.5159 8.5418 25.7662 30.3807 4.2773
temp: 298.150 k
press: 1.00000 atm
elementType: 8 8 7 7 7 6 6 6 6 6 6 6 6 6 6 6 6 6 6 6 1 1 1 1 1 1 1 1 1 1 1 1 1
symmnumber: 1
zpe: 661405.5 jmol-1
zpe.correction: 0.251916 hartree
zpe.thermalcorrener: 0.267998 hartree
zpe.thermalcorrenthalpy: 0.268942 hartree
zpe.thermalcorrgfe: 0.208014 hartree
zpe.sumelectzpe: -892.650998 hartree
zpe.sumelectthermal: -892.634916 hartree
zpe.sumelectthermalent: -892.633972 hartree
zpe.sumelectthermalfe: -892.694900 hartree
dipole: 5.2500 2.5235 1.9129
dipole: 6.1310
quadrupole: -109.2995 -112.8078 -120.3773
quadrupole: -0.8833 -7.7591 1.4040
quadrupole: 4.8620 1.3537 -6.2158 -0.8833 -7.7591 1.4040
hfenergy: -892.9029143 hartree
pointgroup: C01 [X(C15H13N3O2)]
dipole: 1.9726697 1.2075144 0.6847428 debye
polarizability: 282.2588898|-25.100326|262.142728|11.5085536|-26.2200092|89.4682864 unknown
InChI: InChI=1S/C15H13N3O2/c19-10-9-18(17-20)15-13-7-2-1-5-11(13)12-6-3-4-8-14(12)16-15/h1-8,19H,9-10H2
charge 0 multiplicity 1
33 atoms
O  -2.11944 -3.055962 0.395687
O  -4.225063 0.885084 -0.753101
N  -2.304493 0.141969 0.181313
N  -0.314211 -1.048248 0.34724
N  -2.95414 1.007415 -0.740922
C  1.345577 1.255256 0.047526
C  -0.095286 1.382495 0.043723
C  1.950651 -0.067114 0.207775
C  -0.872475 0.151406 0.180514
C  1.073234 -1.19216 0.379738
C  2.133026 2.43864 -0.080261
C  -0.681712 2.682869 -0.046466
C  -3.093511 -0.832967 0.984677
C  3.356252 -0.30885 0.220131
C  1.597825 -2.504991 0.564871
C  1.536179 3.700692 -0.183828
C  0.119927 3.824862 -0.153988
C  3.86419 -1.603649 0.399476
C  2.982622 -2.709437 0.574911
C  -3.298843 -2.216913 0.309723
H  3.224116 2.366133 -0.088352
H  -1.767547 2.783622 -0.049501
H  -4.074947 -0.352134 1.148275
H  -2.57214 -0.96994 1.947192
H  4.05896 0.51942 0.088725
H  0.895199 -3.334722 0.692032
H  2.161448 4.59504 -0.277628
H  -0.345444 4.813497 -0.22067
H  4.947196 -1.766618 0.404408
H  3.388956 -3.716556 0.714278
H  -3.626624 -2.064276 -0.741028
H  -4.111586 -2.737147 0.850142
H  -1.317201 -2.425412 0.336189
