program: Gaussian 09
title: 000282629
version: EM64L-G09RevD.01
frameworkgroup: C1[X(C16H12Cl2N2O2)]
method: RPBEPBE
basis: SDD
operation: Freq
keyword: #p
keyword: freq=noraman
keyword: PBEPBE/SDD
title: #p freq=noraman PBEPBE/SDD
converged: YES YES NO YES
title: Mulliken charges:
elementType: Cl Cl O O N N C C C C C C C C C C C C C C C C H H H H H H H H H H H H
charge: 0.063824 0.063793 -0.202409 -0.127544 -0.510792 -0.472476 -0.690325 0.276827 0.243030 0.287761 0.143832 -0.514836 -0.415053 -0.424949 -0.378037 0.524468 -0.494468 -0.232292 -0.240320 0.316488 0.408808 -0.731990 0.245031 0.245030 0.312034 0.243464 0.241386 0.250189 0.215151 0.226343 0.229316 0.294522 0.294388 0.309805
chargesum: 0.00000
title: Mulliken charges with hydrogens summed into heavy atoms:
elementType: Cl Cl O O N N C C C C C C C C C C C C C C C C
charge: 0.063824 0.063793 -0.202409 -0.127544 -0.216270 -0.178088 -0.200264 0.276827 0.243030 0.287761 0.143832 -0.202802 -0.171589 -0.183563 -0.127848 0.524468 -0.279317 -0.005950 -0.011004 0.316488 0.408808 -0.422185
polarizability: 3.59409599e+02 -9.74195372e+00 2.29333764e+02 4.61327971e-02 2.31553434e-03 1.14709758e+02
1716.lowfreq: -28.1236 -17.1224 -3.6540 -1.0844 0.0015 0.0017 0.0022 5.8700 26.0907
frequency: -28.0364 -16.9515 26.0886 43.6717 45.4532 86.4959 105.8775 109.5301 130.7283 162.5080 197.6004 212.2562 217.1915 253.2295 265.1525 276.1657 323.8595 330.7141 351.3337 414.5102 417.2033 436.9935 475.4014 500.5715 510.3484 515.4297 588.8721 614.3622 622.3677 626.0117 627.5756 634.6200 701.5949 704.5901 711.9835 735.9140 740.3250 760.3496 779.8338 782.3343 800.0545 810.6016 817.1579 872.7371 887.0916 919.7772 933.2343 947.3170 947.8395 961.0028 969.3598 989.1172 1013.4758 1029.1315 1097.5705 1113.4969 1128.6236 1131.5404 1146.3675 1170.0023 1180.3703 1184.6684 1195.2917 1206.7494 1230.1150 1253.4670 1265.5457 1291.4339 1310.7211 1378.2224 1390.4100 1423.7425 1432.2507 1441.8381 1451.3548 1482.0735 1489.4351 1514.5941 1591.3660 1598.1727 1621.8241 1628.9273 1660.1628 1696.9450 2979.8190 3023.2474 3090.4655 3107.5680 3122.5676 3131.6400 3142.7619 3144.2887 3162.5807 3191.2340 3510.9719 3524.8287
redmass: 12.1962 12.8542 9.7474 8.4821 5.1259 5.1957 4.9100 9.0818 4.1568 10.7355 4.6968 7.6823 3.7570 11.5414 3.5338 11.6923 2.8176 12.0891 7.3582 6.7217 2.8584 2.6575 1.7211 4.3705 2.4691 6.5883 6.9962 11.0386 2.3819 1.4413 7.1205 7.5793 2.6909 6.9423 9.5025 6.3420 1.6513 10.1286 2.0794 5.9547 4.5030 1.5264 5.2888 1.3511 6.5993 1.5774 1.4575 1.4269 6.7783 5.9640 1.8114 1.3288 3.0772 2.2037 2.1160 2.0898 1.1475 1.6375 3.2768 1.1502 1.3751 1.0630 2.0778 1.8922 2.2812 1.8531 1.7398 1.5177 1.8631 5.3703 4.9589 1.5548 1.7675 1.8994 2.5221 3.8982 3.2531 1.9435 6.6114 5.3615 7.3266 7.0105 4.6684 9.1172 1.0608 1.0993 1.0893 1.0885 1.0861 1.0892 1.0956 1.0948 1.1003 1.0929 1.0773 1.0760
irintensity: 0.0747 0.0192 0.9559 1.3396 4.5539 8.9057 1.7414 0.5254 0.2806 0.7673 2.3473 2.6352 4.3272 0.2763 1.7398 1.2867 0.9014 0.5434 3.7534 7.3270 10.3770 0.6203 3.9738 6.7459 1.8229 20.3297 10.1876 60.1316 118.6716 45.4655 17.3859 13.8462 20.2144 1.3098 56.0277 0.2108 34.1941 28.0266 60.1603 13.8911 5.4436 42.7303 0.1097 2.6134 2.0371 0.4411 28.8252 0.0428 61.5818 6.0320 11.3397 0.0120 2.2214 10.1202 4.7437 381.7236 0.0087 37.5788 190.1395 0.5458 4.6655 9.5963 26.3157 6.9462 47.2502 10.6914 4.3782 15.0404 0.1495 30.0611 14.5175 135.8733 19.9377 925.1955 15.2869 6.3013 81.0714 128.7582 1.5245 57.8474 1.5377 38.9028 2.4298 303.1341 18.6667 8.2945 14.2516 17.5167 3.9104 4.3907 21.6817 28.8319 34.3540 6.0093 1.3191 18.5148
temp: 298.150 k
press: 1.00000 atm
elementType: 17 17 8 8 7 7 6 6 6 6 6 6 6 6 6 6 6 6 6 6 6 6 1 1 1 1 1 1 1 1 1 1 1 1
symmnumber: 1
zpe: 644644.8 jmol-1
zpe.correction: 0.245532 hartree
zpe.thermalcorrener: 0.263124 hartree
zpe.thermalcorrenthalpy: 0.264068 hartree
zpe.thermalcorrgfe: 0.198233 hartree
zpe.sumelectzpe: -1795.463937 hartree
zpe.sumelectthermal: -1795.446346 hartree
zpe.sumelectthermalent: -1795.445402 hartree
zpe.sumelectthermalfe: -1795.511237 hartree
dipole: 2.6759 7.6852 -0.0038
dipole: 8.1377
quadrupole: -135.3467 -129.3576 -146.5874
quadrupole: -17.9889 0.0217 -0.0042
quadrupole: 1.7505 7.7396 -9.4902 -17.9889 0.0217 -0.0042
hfenergy: -1795.7094697 hartree
pointgroup: C01 [X(C16H12Cl2N2O2)]
dipole: -1.0366659 -3.0291441 -0.0008231 debye
polarizability: 359.5096441|-9.0488924|229.233713|-0.0413032|-0.0282408|114.7097635 unknown
InChI: InChI=1S/C16H12Cl2N2O2/c17-14(18)15(21)20-16(22)19-11-6-5-10-7-9-3-1-2-4-12(9)13(10)8-11/h1-6,8,14,19-20H,7H2
charge 0 multiplicity 1
34 atoms
Cl 7.079933 0.32631 1.535491
Cl 7.083228 0.327665 -1.532702
O  1.862592 1.14999 -0.00105
O  4.659966 1.828352 0.000288
N  1.526515 -1.184634 -0.000591
N  3.709956 -0.343283 -0.00118
C  -4.221903 -1.594798 0.000897
C  -2.69995 -1.669503 0.000548
C  -2.142819 -0.35515 0.00005
C  -4.485671 -0.092297 0.000558
C  -3.248532 0.621905 0.000061
C  -0.749208 -0.139361 -0.000348
C  -1.849052 -2.787533 0.000657
C  -5.708545 0.601106 0.000678
C  -3.232218 2.03426 -0.000318
C  0.099079 -1.276154 -0.000226
C  -0.450398 -2.589856 0.000276
C  -5.692524 2.018879 0.000299
C  -4.464433 2.727579 -0.000194
C  2.30079 -0.021831 -0.001069
C  4.767311 0.588273 -0.000972
C  6.139402 -0.136406 0.000165
H  -4.661133 -2.09077 0.889055
H  -4.661567 -2.09125 -0.88678
H  -0.318919 0.863222 -0.000712
H  -2.252693 -3.805961 0.00104
H  -6.662389 0.060887 0.001061
H  -2.286067 2.586822 -0.000697
H  0.219785 -3.459868 0.000368
H  -6.637416 2.57385 0.000388
H  -4.471835 3.823161 -0.00048
H  2.004661 -2.088345 -0.000349
H  3.973084 -1.332153 -0.001337
H  6.08617 -1.234506 -0.000375
