program: Gaussian 09
title: 000282632
version: EM64L-G09RevD.01
frameworkgroup: C1[X(C19H10Cl3N)]
method: RPBEPBE
basis: SDD
operation: Freq
keyword: #p
keyword: freq=noraman
keyword: PBEPBE/SDD
title: #p freq=noraman PBEPBE/SDD
converged: YES YES NO NO
title: Mulliken charges:
elementType: Cl Cl Cl N C C C C C C C C C C C C C C C C C C C H H H H H H H H H H
charge: -0.036730 -0.039062 -0.052204 0.010724 0.314491 0.218687 0.031967 0.144700 0.322702 -0.305515 -0.336572 -0.416922 -0.317908 -0.414455 -0.134987 -0.272320 -0.246933 -0.155386 0.374570 -0.339471 -0.481151 -0.187153 -0.338575 0.267796 0.283488 0.298282 0.232887 0.281243 0.260576 0.287432 0.255915 0.239837 0.250045
chargesum: 0.00000
title: Mulliken charges with hydrogens summed into heavy atoms:
elementType: Cl Cl Cl N C C C C C C C C C C C C C C C C C C C
charge: -0.036730 -0.039062 -0.052204 0.010724 0.314491 0.218687 0.031967 0.144700 0.322702 -0.305515 -0.068776 -0.133434 -0.019626 -0.181568 -0.134987 0.008923 0.013642 -0.155386 0.374570 -0.052038 -0.225236 0.052684 -0.088530
polarizability: 4.12466322e+02 -1.09219557e+01 3.21567227e+02 2.90015153e+00 1.41828481e+01 1.04079741e+02
1716.lowfreq: -3.7970 -2.3030 -0.0002 0.0010 0.0013 2.3664 25.7610 32.3559 49.4289
frequency: 25.7570 32.3363 49.4285 70.5419 78.2135 109.6262 132.6765 143.7089 155.5494 174.5005 189.5722 224.6178 232.6504 249.7370 265.3062 305.0326 368.8654 373.7308 380.8987 396.9509 404.6454 418.3244 452.3799 492.3791 539.9786 546.5354 557.7896 565.6472 568.1941 602.9580 635.4579 637.3526 689.1222 704.8262 719.7305 727.6922 765.8765 775.2593 797.5165 814.8407 828.1765 851.5492 857.3469 871.2516 879.4332 896.5579 925.8817 949.1322 962.8180 963.1963 996.6149 1001.7889 1003.5322 1028.7548 1070.0354 1082.0509 1100.9347 1115.3120 1147.6634 1166.7348 1198.1051 1222.4316 1245.0140 1253.1016 1280.6908 1303.8195 1326.7558 1352.0718 1361.9924 1368.7530 1405.2296 1417.3835 1424.3165 1431.7115 1457.9296 1470.4255 1541.0348 1557.5700 1570.4735 1578.0685 1598.9351 1603.2038 1637.4649 3082.0671 3116.7750 3138.6858 3152.4737 3163.4987 3166.9108 3172.4703 3184.7631 3187.2244 3188.5867
redmass: 13.9171 6.6383 8.3173 5.4195 6.0983 16.2559 8.6754 7.4458 5.0793 14.0526 4.5984 10.1749 6.7324 7.7884 8.8335 3.9796 6.1624 7.0401 8.0545 3.8371 7.0746 3.8381 4.1112 3.8358 5.1257 6.6729 7.6779 3.7367 5.8344 7.0352 6.8719 4.6337 6.9974 7.6845 2.0074 4.2144 4.8164 6.1632 4.0070 2.0163 1.4469 5.0248 1.4535 1.6982 1.4438 1.4187 1.4851 1.8167 1.3779 3.5506 1.9631 4.3458 2.3530 3.1129 2.1834 2.1336 2.3274 1.7204 1.6122 2.6467 1.3826 2.0521 2.0272 2.0386 1.6554 6.1554 1.6845 2.0612 2.1953 4.4715 2.2030 4.4049 2.6237 3.7706 2.2552 4.4595 4.9388 8.6535 7.4256 5.7396 8.4696 7.6782 8.6747 1.0866 1.0912 1.0881 1.0922 1.0926 1.0898 1.1002 1.0930 1.0934 1.0960
irintensity: 0.1200 1.0820 0.1441 0.9341 0.1244 0.2898 0.1269 0.5061 2.1995 0.2945 0.0683 0.1050 0.8991 0.4028 0.2817 2.1482 1.5877 3.6829 16.9226 3.1358 8.4486 2.9402 8.4995 5.2891 0.4982 1.7388 6.3939 0.2184 1.9479 2.0977 8.0087 9.6439 19.4755 30.9574 33.1207 7.8381 6.0242 36.3535 22.2267 23.3757 45.3013 3.7767 22.5942 18.2555 16.2708 11.1407 19.3204 28.6671 1.4247 52.1249 4.1564 16.7403 1.5494 0.0987 5.1472 29.8624 9.9535 3.7619 6.3769 42.0718 0.7356 20.9600 16.5881 12.8484 6.3038 0.3587 6.2134 8.1645 3.8179 12.1116 11.7787 82.7417 133.1810 16.7395 2.4560 84.0742 6.6004 54.9642 12.4070 6.3643 45.0433 4.3524 21.9866 8.3069 14.0085 2.5705 17.4418 0.8060 0.7766 15.1843 0.5374 1.9817 2.8453
temp: 298.150 k
press: 1.00000 atm
elementType: 17 17 17 7 6 6 6 6 6 6 6 6 6 6 6 6 6 6 6 6 6 6 6 1 1 1 1 1 1 1 1 1 1
symmnumber: 1
zpe: 599537.9 jmol-1
zpe.correction: 0.228352 hartree
zpe.thermalcorrener: 0.247167 hartree
zpe.thermalcorrenthalpy: 0.248111 hartree
zpe.thermalcorrgfe: 0.179259 hartree
zpe.sumelectzpe: -2163.411577 hartree
zpe.sumelectthermal: -2163.392762 hartree
zpe.sumelectthermalent: -2163.391818 hartree
zpe.sumelectthermalfe: -2163.460670 hartree
dipole: 0.3973 0.3126 1.4808
dipole: 1.5647
quadrupole: -156.0421 -157.8026 -155.9425
quadrupole: -0.6893 9.0430 -1.3669
quadrupole: 0.5536 -1.2069 0.6532 -0.6893 9.0430 -1.3669
hfenergy: -2163.6399292 hartree
pointgroup: C01 [X(C19H10Cl3N1)]
dipole: 0.1378951 -0.0869507 -0.5936178 debye
polarizability: 413.737258|-1.1934266|315.6589477|-1.5488683|34.4826497|108.717084 unknown
InChI: InChI=1S/C19H10Cl3N/c20-12-3-4-14-16(7-12)15(6-11-2-1-5-23-10-11)17-8-13(21)9-18(22)19(14)17/h1-10H
charge 0 multiplicity 1
33 atoms
Cl -4.514291 -2.003486 -0.406205
Cl -4.548737 3.468869 0.384077
Cl 2.651438 -4.178219 -0.103682
N  4.475832 2.631757 0.853904
C  -2.156952 -0.476598 -0.08421
C  -1.136676 -1.536632 -0.17778
C  -1.481416 0.775282 0.117791
C  0.161093 -0.925696 -0.056789
C  -0.008642 0.544378 0.106882
C  -3.563202 -0.468317 -0.141082
C  -2.190913 1.983505 0.25386
C  -1.260786 -2.935919 -0.313712
C  1.318878 -1.732898 -0.019051
C  0.898744 1.569756 0.261892
C  -3.597288 1.928337 0.198377
C  -4.304075 0.724248 0.000901
C  -0.09828 -3.740973 -0.307042
C  1.160913 -3.126671 -0.146835
C  2.361494 1.595253 0.113141
C  3.077516 0.860721 -0.8759
C  3.125028 2.483582 0.930655
C  4.475701 1.007124 -0.972607
C  5.136305 1.891134 -0.086782
H  -1.686582 2.942941 0.395848
H  -2.241347 -3.405766 -0.412081
H  2.314699 -1.311563 0.126335
H  0.471693 2.547519 0.530823
H  -5.395325 0.713323 -0.043611
H  -0.171303 -4.826936 -0.411809
H  2.539237 0.220335 -1.581272
H  2.622983 3.096955 1.689837
H  5.045862 0.460524 -1.729996
H  6.221594 2.032928 -0.132278
