program: Gaussian 09
title: 000282603
version: EM64L-G09RevD.01
frameworkgroup: C1[X(C13H5Br3ClN)]
method: RPBEPBE
basis: SDD
operation: Freq
keyword: #p
keyword: freq=noraman
keyword: PBEPBE/SDD
title: #p freq=noraman PBEPBE/SDD
converged: NO NO NO NO
title: Mulliken charges:
elementType: Br Br Br Cl N C C C C C C C C C C C C C H H H H H
charge: 0.072246 0.084450 0.042487 -0.009803 0.085111 0.320597 0.350836 0.451879 -0.073835 -0.286961 -0.354775 -0.558423 -0.309145 -0.257417 -0.228794 -0.195613 -0.209548 -0.242144 0.248520 0.237391 0.278863 0.294970 0.259109
chargesum: 0.00000
title: Mulliken charges with hydrogens summed into heavy atoms:
elementType: Br Br Br Cl N C C C C C C C C C C C C C
charge: 0.072246 0.084450 0.042487 -0.009803 0.085111 0.320597 0.350836 0.451879 -0.073835 -0.038442 -0.117384 -0.558423 -0.030282 0.037553 -0.228794 0.063496 -0.209548 -0.242144
polarizability: 4.19570301e+02 -3.09919989e+00 2.19614773e+02 -9.44505131e-03 3.34840470e-03 6.89640483e+01
1716.lowfreq: -2.4204 0.0002 0.0012 0.0015 4.0672 4.4393 26.2153 44.1318 80.1422
frequency: 26.2059 44.1229 80.1418 85.5788 120.2387 134.2517 137.0670 153.6523 171.1393 205.7894 224.8778 276.3568 289.3528 310.2821 375.9104 377.6805 408.3976 426.3903 453.5180 484.9311 530.2900 539.2732 566.1511 623.0985 630.4573 647.2342 649.9186 718.3327 724.5342 780.2943 781.8037 833.5688 865.2174 881.1500 905.1265 913.9102 935.6353 970.0187 995.8495 1077.1863 1096.4993 1132.7763 1173.0335 1239.3768 1248.2564 1268.3148 1294.0920 1335.0416 1371.8372 1395.3340 1402.6799 1432.7987 1448.4009 1500.0873 1538.5382 1563.4305 1587.8713 1604.7866 3152.9245 3170.1355 3178.5182 3181.7212 3183.7536
redmass: 36.1794 9.6725 24.0807 8.5865 59.3428 5.9546 25.9074 5.4578 42.4449 24.4397 8.7923 10.8028 13.3819 5.8623 11.9818 6.8638 7.2139 3.6624 3.5986 7.4184 8.0932 3.8423 6.4462 9.2012 9.0653 8.1032 5.7691 3.8328 6.8636 2.5028 8.4821 1.6674 9.0115 1.7262 1.4654 1.4920 7.0465 1.3594 6.5998 2.1773 2.1302 2.6865 2.3309 2.0070 1.2958 3.7714 1.7817 4.6334 5.1620 6.2763 4.7602 4.8974 3.4949 4.9742 8.4354 10.5893 7.2996 7.1437 1.0888 1.0907 1.0956 1.0932 1.0931
irintensity: 0.0101 0.4951 0.0198 0.2373 0.3073 0.0150 0.1550 0.0009 0.0057 0.0042 0.0007 1.1333 5.4719 0.8088 26.8869 2.3085 11.1562 2.3654 15.0756 4.5931 10.8761 10.2934 8.4900 0.1385 1.0959 17.0134 0.7432 2.0927 5.5581 2.1753 63.4481 37.9521 66.8941 8.5306 30.9782 8.6216 120.9361 0.3805 27.3078 54.4475 31.6745 14.7830 32.6732 5.3098 13.5669 70.3855 17.8127 4.6559 3.2381 39.6507 38.2411 46.7566 158.5744 9.3563 124.8914 66.3447 21.8273 17.0200 2.5100 0.8932 2.5381 4.1922 1.2496
temp: 298.150 k
press: 1.00000 atm
elementType: 35 35 35 17 7 6 6 6 6 6 6 6 6 6 6 6 6 6 1 1 1 1 1
symmnumber: 1
zpe: 363994.6 jmol-1
zpe.correction: 0.138638 hartree
zpe.thermalcorrener: 0.154278 hartree
zpe.thermalcorrenthalpy: 0.155223 hartree
zpe.thermalcorrgfe: 0.092025 hartree
zpe.sumelectzpe: -1052.372528 hartree
zpe.sumelectthermal: -1052.356888 hartree
zpe.sumelectthermalent: -1052.355944 hartree
zpe.sumelectthermalfe: -1052.419142 hartree
dipole: -0.7058 -3.0770 0.0000
dipole: 3.1569
quadrupole: -142.5640 -137.1396 -141.3116
quadrupole: 4.8681 0.0000 -0.0003
quadrupole: -2.2256 3.1988 -0.9732 4.8681 0.0000 -0.0003
hfenergy: -1052.5111665 hartree
pointgroup: C01 [X(C13H5Br3Cl1N1)]
dipole: -0.3169579 1.2008881 0.0002621 debye
dipolederiv: -0.3358663 -0.2828017 -0.0001908 -0.4999485 -0.4015673 -0.0000175 -0.0001176 -0.000117 0.01593 -0.7847086 0.1495841 0.0000352 0.2381333 -0.0197088 -0.0000305 0.000118 -0.0000186 0.0203591 -0.9074808 0.1596902 0.0000689 0.1113574 -0.0552162 0.0000569 -0.0000036 -0.000016 -0.0126545 -0.4992504 -0.4259583 -0.0001044 -0.4813361 -0.7103598 -0.0001604 -0.0001293 -0.0001342 -0.0797908 -0.9576105 -0.3153848 -0.0000959 0.2293431 -0.3484468 -0.0000356 0.0000768 -0.0000918 -0.167741 0.2617966 0.0772168 0.0000129 -0.2283665 0.0148304 0.0000555 -0.0001484 -0.000023 0.0170771 -0.0080847 -0.0696054 -0.0000342 0.1958156 -0.0517805 -0.0000503 -0.000092 -0.0000468 0.0469805 0.0785586 -0.1581097 -0.000066 -0.1027496 -0.4760841 -0.0001389 0.0000047 -0.0000969 0.0907704 0.5238034 0.202139 0.0000975 -0.0404929 0.0895021 0.0000109 0.0001402 0.0000582 0.0429175 -0.2830007 -0.1788716 -0.0000374 -0.111055 -0.1401998 0.0000122 0.0002214 0.0000345 -0.0767196 -0.1352378 0.0660114 -0.000036 0.0366603 0.0452952 0.0000241 0.0001903 0.0000547 -0.1268161 0.9631367 0.6921743 0.0001889 0.3826376 1.3186529 0.0003105 -0.0000077 0.0002954 0.0050434 -0.5361789 0.0726853 0.0000707 0.2956295 -0.0186257 0.0000296 0.0000171 0.0000052 -0.0661752 -0.4095218 0.0655999 0.0000207 -0.0964876 0.0206339 0.0000117 -0.0000546 0.0000038 -0.0673045 0.2365165 0.7516086 0.0002941 0.8198656 0.7241164 0.0001211 -0.0000094 0.0001645 -0.0992779 -0.4046297 -0.0037418 0.0000056 0.0532372 0.1105262 0.0000732 -0.0000469 0.0000407 -0.0726732 1.2324474 -0.5393489 -0.0001311 -0.4895471 -0.1445728 -0.0000341 -0.0001209 0.0000389 -0.1044545 1.6228909 -0.2596076 -0.0001026 -0.2912504 -0.0244018 -0.0000107 0.0000737 0.0000317 -0.1334235 0.0740792 0.0676688 0.000008 0.0256229 -0.0246211 -0.0000316 0.0000108 -0.0000564 0.1460502 0.0134997 -0.0957202 -0.0000187 -0.0628589 -0.006272 -0.0000494 -0.000078 -0.0000466 0.1461159 0.0933218 -0.0223757 -0.0000119 -0.0792194 0.0777425 -0.0000361 0.0000265 -0.0000039 0.1579302 0.0910966 -0.0066551 -0.0000115 0.0358888 0.0298964 0.0000007 -0.0000042 -0.0000349 0.1603727 0.070423 0.0538024 0.0000381 0.0591207 -0.0093391 -0.0001113 -0.0000668 -0.0000415 0.1574834 unknown
polarizability: 419.1566419|9.5993379|220.0284233|0.0065286|0.0358813|68.9640565 unknown
InChI: InChI=1S/C13H5Br3ClN/c14-6-1-2-7-8-4-10(15)11(16)5-12(8)18-13(17)9(7)3-6/h1-5H
charge 0 multiplicity 1
23 atoms
Br 4.211417 2.603572 0.000462
Br 5.337471 -0.69626 -0.00021
Br -5.568117 1.102855 0.000323
Cl -2.115665 -3.394864 -0.000751
N  0.250079 -2.128214 -0.000501
C  -0.80321 0.546308 0.000081
C  0.640837 0.325635 0.000016
C  -1.678766 -0.602121 -0.000143
C  1.118451 -1.031417 -0.000269
C  1.603191 1.372409 0.000223
C  -1.399932 1.841035 0.000362
C  -1.038344 -1.908502 -0.000439
C  -3.093342 -0.433017 -0.000071
C  2.514223 -1.303255 -0.000325
C  2.977811 1.094692 0.000162
C  -2.791035 2.005825 0.00043
C  3.441714 -0.254942 -0.000113
C  -3.627046 0.857499 0.000214
H  1.289052 2.419087 0.000439
H  -0.772028 2.736763 0.000534
H  -3.738193 -1.314925 -0.000239
H  2.833438 -2.348084 -0.000532
H  -3.231005 3.006718 0.000646
