program: Gaussian 09
title: 000282601
version: EM64L-G09RevD.01
frameworkgroup: C1[X(C13H7Cl2N)]
method: RPBEPBE
basis: SDD
operation: Freq
keyword: #p
keyword: freq=noraman
keyword: PBEPBE/SDD
title: #p freq=noraman PBEPBE/SDD
converged: NO NO NO NO
title: Mulliken charges:
elementType: Cl Cl N C C C C C C C C C C C C C H H H H H H H
charge: -0.028891 -0.050245 0.077758 0.307693 0.332851 0.441410 -0.082092 -0.359184 -0.307544 -0.551073 -0.376257 -0.293482 -0.242515 -0.154653 -0.231363 -0.236726 0.231224 0.248963 0.260417 0.274360 0.236620 0.238760 0.263969
chargesum: 0.00000
title: Mulliken charges with hydrogens summed into heavy atoms:
elementType: Cl Cl N C C C C C C C C C C C C C
charge: -0.028891 -0.050245 0.077758 0.307693 0.332851 0.441410 -0.082092 -0.127961 -0.058581 -0.551073 -0.115840 -0.019122 -0.005894 -0.154653 0.007397 0.027243
polarizability: 2.77557418e+02 -1.55077172e+01 1.92106333e+02 -5.46296426e-03 2.10605651e-03 5.97040123e+01
1716.lowfreq: -7.6591 0.0018 0.0026 0.0033 5.7068 7.6892 53.7112 88.6292 127.2700
frequency: 53.7095 88.6288 127.2699 144.2026 179.0703 206.4429 243.2360 267.4249 325.8302 358.9855 388.9919 421.4121 438.0237 438.4959 473.6718 516.7036 551.6627 585.5814 618.3094 628.3062 644.5202 711.0319 729.3428 750.6494 777.8054 787.5113 835.9415 835.9704 877.7407 885.7567 926.7929 970.4002 971.7060 1001.8782 1004.5554 1041.7440 1075.7852 1103.3843 1137.9332 1181.1489 1201.4960 1238.8190 1264.4502 1289.8160 1305.5690 1366.9792 1384.9159 1416.5733 1426.7228 1447.3038 1473.6814 1521.7866 1557.5705 1574.7839 1607.3639 1619.9625 3136.9020 3150.6492 3163.0629 3164.4978 3171.1148 3176.3775 3184.0627
redmass: 10.9647 4.3507 4.7210 11.3157 8.2642 11.0703 4.6525 13.4529 7.8005 6.6490 9.7645 3.3845 7.3260 3.4153 6.9610 3.3676 6.8039 4.2062 7.1855 4.2794 9.1340 6.7109 3.6960 6.5511 1.4727 2.3345 1.5610 7.1487 1.6753 1.5732 7.5944 1.3775 1.3452 1.3437 6.3840 2.0294 2.3622 2.0857 1.4368 1.0968 2.6067 1.9207 1.6182 2.3811 2.3956 4.0498 5.5382 3.6849 3.1703 3.7324 2.9438 4.5440 8.7320 8.2081 6.8651 6.5726 1.0859 1.0897 1.0952 1.0886 1.0916 1.0991 1.0983
irintensity: 0.4204 0.8166 0.5590 0.8844 0.8619 0.2516 0.1360 2.0201 0.2735 1.0153 14.7089 0.4023 26.3164 4.8839 2.8029 1.9974 10.4674 17.2776 3.4442 2.2248 1.6209 5.3982 6.1027 8.0358 75.9742 2.3247 50.7469 66.8353 12.0222 0.0051 78.2604 2.0646 0.4033 0.0632 24.6412 8.7529 36.1389 3.2431 10.6889 3.2703 41.6950 1.6406 17.1638 40.3041 14.7853 3.6349 5.0060 17.0510 29.3818 1.6277 84.1738 18.7020 57.0647 47.8220 34.7648 11.7207 1.3995 9.1039 7.9458 0.3094 5.2861 18.7744 2.7867
temp: 298.150 k
press: 1.00000 atm
elementType: 17 17 7 6 6 6 6 6 6 6 6 6 6 6 6 6 1 1 1 1 1 1 1
symmnumber: 1
zpe: 419602.3 jmol-1
zpe.correction: 0.159818 hartree
zpe.thermalcorrener: 0.171995 hartree
zpe.thermalcorrenthalpy: 0.172939 hartree
zpe.thermalcorrgfe: 0.120541 hartree
zpe.sumelectzpe: -1473.403434 hartree
zpe.sumelectthermal: -1473.391258 hartree
zpe.sumelectthermalent: -1473.390314 hartree
zpe.sumelectthermalfe: -1473.442712 hartree
dipole: -0.2080 3.2137 0.0003
dipole: 3.2204
quadrupole: -105.4793 -96.8240 -109.7893
quadrupole: -12.9890 -0.0003 0.0002
quadrupole: -1.4484 7.2069 -5.7584 -12.9890 -0.0003 0.0002
hfenergy: -1473.5632524 hartree
pointgroup: C01 [X(C13H7Cl2N1)]
dipole: 0.4146843 -1.1972335 0.0001114 debye
dipolederiv: -0.6512252 -0.4457516 0.0000277 -0.4947793 -0.5725382 0.0000273 0.0000426 0.0000308 -0.0957043 -0.7329209 -0.299937 -0.0000403 -0.4998202 -0.3646722 -0.0000353 -0.0000564 -0.0000308 -0.0645207 -0.8527365 -0.2434866 0.0000409 0.3113461 -0.3539334 0.0000023 0.0000255 0.0000234 -0.1731612 0.2022367 0.042142 -0.0000007 -0.2683517 0.0928963 -0.0000114 0.0000043 -0.0000037 0.0120328 0.0625583 -0.0574772 0.0000149 0.1793957 -0.0538644 0.000013 0.0000304 -0.0000074 0.0446541 -0.1269595 -0.2088314 0.0000163 -0.2055137 -0.411157 0.000014 0.0000335 0.0000157 0.0863045 0.3519342 0.1849518 -0.0000192 -0.0271663 0.0198455 -0.0000068 -0.000024 -0.0000105 0.0357329 -0.1614316 0.1246896 0.0000042 0.1842108 -0.0465366 0.0000071 -0.0000078 0.0000148 -0.1384825 -0.4112012 -0.0942008 -0.0000217 -0.1084759 -0.0691568 -0.0000052 -0.0000272 -0.0000107 -0.1079262 1.1902159 0.7075725 -0.0000816 0.4343695 1.1133669 -0.0000492 -0.0000796 -0.0000709 0.0072157 -0.0358461 -0.0158464 0.0000053 0.1971107 0.0347376 0.0000004 -0.0000105 0.000004 -0.1258185 0.06061 -0.005881 0.000009 -0.1058014 0.1247476 0.0000109 -0.0000006 0.000024 -0.1313715 0.0239529 -0.0156429 0.0000067 -0.0031743 0.1801174 -0.0000124 0.0000061 -0.0000136 -0.1331758 0.9871365 0.5067048 0.0000729 0.7593618 0.5386503 0.0000703 0.000105 0.0000617 -0.0608992 0.1110446 -0.0461794 0.0000205 -0.0987767 -0.1285045 -0.0000055 0.0000238 -0.0000091 -0.1465328 -0.2053954 -0.1578873 -0.0000242 -0.2744016 -0.1703995 -0.0000131 -0.0000358 -0.000011 -0.1099198 0.0059295 -0.1141045 -0.0000073 -0.0715372 0.0115065 -0.0000009 -0.0000081 -0.0000059 0.1457518 0.1048779 0.0369339 0.0000016 -0.0045498 -0.0375919 -0.0000077 -0.0000055 -0.0000067 0.1534237 0.0452192 -0.0369711 -0.0000037 -0.0940887 0.0558347 -0.0000006 -0.0000002 0.0000044 0.1571913 0.0888958 -0.0126897 -0.0000008 0.0350949 -0.0250275 -0.0000103 0.0000076 -0.0000082 0.1612921 0.0748151 0.0414333 -0.0000057 0.0654697 -0.0993281 0.0000109 -0.0000056 0.0000094 0.1573914 -0.1004217 0.0639347 -0.0000166 0.0591345 0.0695271 0.0000067 -0.0000175 0.0000077 0.1590419 -0.0312884 0.0465245 0.0000017 0.030943 0.0914802 -0.0000046 0.0000002 -0.0000072 0.1674804 unknown
polarizability: 279.4718721|8.5575708|190.1918795|0.0058261|-0.0005797|59.7040123 unknown
InChI: InChI=1S/C13H7Cl2N/c14-8-5-6-12-11(7-8)9-3-1-2-4-10(9)13(15)16-12/h1-7H
charge 0 multiplicity 1
23 atoms
Cl 2.670234 2.958079 -0.000198
Cl -4.520428 -1.730067 -0.000323
N  0.123518 2.105873 -0.000081
C  0.707911 -0.709031 -0.000078
C  -0.680837 -0.246264 -0.000115
C  1.767004 0.275058 -0.000059
C  -0.921819 1.174394 -0.000077
C  1.073175 -2.087803 -0.000025
C  -1.804351 -1.12292 -0.000188
C  1.354592 1.668373 -0.000087
C  3.130045 -0.141276 0.000019
C  -2.253872 1.678926 -0.000052
C  2.418806 -2.480009 0.000059
C  -3.096219 -0.590172 -0.000192
C  3.454714 -1.503677 0.000085
C  -3.348751 0.806225 -0.000109
H  0.296726 -2.858715 -0.000061
H  -1.675274 -2.208131 -0.000233
H  3.914196 0.621286 0.000025
H  -2.389122 2.76396 0.00001
H  2.674607 -3.545025 0.000107
H  4.503306 -1.818823 0.00016
H  -4.37516 1.182742 -0.00009
