program: Gaussian 09
title: 000282622
version: EM64L-G09RevD.01
frameworkgroup: C1[X(C20H10Cl3F)]
method: RPBEPBE
basis: SDD
operation: Freq
keyword: #p
keyword: freq=noraman
keyword: PBEPBE/SDD
title: #p freq=noraman PBEPBE/SDD
converged: YES YES NO NO
title: Mulliken charges:
elementType: Cl Cl Cl F C C C C C C C C C C C C C C C C C C C C H H H H H H H H H H
charge: -0.037651 -0.040523 -0.053576 -0.203203 0.027790 0.317058 0.315863 0.144963 0.221443 -0.337508 -0.306715 -0.315674 -0.418948 -0.414421 -0.134547 -0.273762 -0.156690 -0.248355 0.437149 -0.533635 -0.425934 0.329911 -0.192624 -0.383266 0.267705 0.233409 0.301290 0.283213 0.280937 0.260061 0.268514 0.281753 0.241916 0.264053
chargesum: 0.00000
title: Mulliken charges with hydrogens summed into heavy atoms:
elementType: Cl Cl Cl F C C C C C C C C C C C C C C C C C C C C
charge: -0.037651 -0.040523 -0.053576 -0.203203 0.027790 0.317058 0.315863 0.144963 0.221443 -0.069803 -0.306715 -0.014384 -0.135735 -0.181012 -0.134547 0.007175 -0.156690 0.011707 0.437149 -0.265121 -0.144181 0.329911 0.049293 -0.119213
polarizability: 4.20384329e+02 -1.54254548e+00 3.25823660e+02 -5.88109280e+00 1.10224579e+01 1.09359261e+02
1716.lowfreq: -5.6427 -2.4301 -1.5864 -0.0021 -0.0021 -0.0018 22.4826 27.7931 47.2589
frequency: 22.4670 27.7788 47.2567 64.5495 77.7092 108.1051 126.3552 141.6597 147.2860 172.0366 189.3248 205.2830 232.3279 235.1849 255.8089 262.8669 300.7228 361.7799 375.5398 377.3161 401.5902 409.4520 421.6536 443.2606 470.6727 499.6213 520.3377 543.9707 556.0889 563.5316 566.4832 581.4926 619.4422 636.7646 681.4272 691.9834 696.1291 726.9286 760.2921 765.9531 787.0319 796.5188 810.2922 827.1102 854.8340 857.8124 876.3084 887.4344 894.0352 921.0676 937.3594 959.7885 962.3463 984.5465 987.1610 1000.9810 1070.2012 1081.3487 1083.2253 1100.8704 1136.5825 1153.4500 1166.5531 1179.4908 1222.2616 1245.5822 1254.5767 1281.1222 1296.9448 1335.1567 1356.6618 1367.6912 1388.4177 1417.1594 1422.8585 1427.5607 1434.2324 1467.1724 1478.2868 1557.4597 1570.5341 1579.0771 1598.8086 1603.1445 1612.1400 1640.1527 3083.3764 3147.8994 3160.3368 3161.8206 3167.1358 3168.1233 3183.4381 3186.0853 3186.3750 3188.9766
redmass: 13.1430 10.4378 9.0602 5.7757 6.9197 15.8741 8.2520 7.8021 6.2193 15.6387 4.5663 11.4849 6.7382 6.8133 8.7785 9.5878 4.0956 6.9786 6.0378 12.0530 8.4312 4.8677 4.3927 3.0748 3.8798 8.6497 5.0628 5.7439 7.3799 4.0095 5.2022 4.9587 6.2925 4.6583 4.2487 5.3591 4.0185 4.2469 5.0124 4.8848 6.1785 1.5761 6.6033 1.4270 1.5261 1.4412 1.4698 1.5580 1.5350 1.3685 3.7146 5.7458 1.3812 2.2520 2.2192 5.6019 2.1716 1.6317 1.9735 2.3664 1.6043 1.7654 2.5293 1.1653 2.3640 2.0598 2.3991 1.5928 1.6890 1.7557 3.5402 6.9798 4.3733 4.4756 3.0459 3.2553 3.2827 4.0749 2.9335 8.6241 7.4861 6.1762 8.5427 7.5510 6.9942 8.5914 1.0868 1.0875 1.0926 1.0928 1.0896 1.0938 1.0977 1.0935 1.0945 1.0949
irintensity: 0.1439 0.2829 0.1186 0.4039 0.2026 0.2386 0.2801 0.3516 1.1893 0.2818 0.1269 0.2491 0.9276 0.1393 0.4359 1.4075 3.7337 0.4589 1.8933 16.1140 15.7163 0.3060 0.9384 12.2356 6.3248 3.0871 1.7668 0.9670 10.6258 0.1606 0.5599 6.6497 3.5442 8.9729 11.7520 49.0785 10.8662 12.5841 30.6737 4.8202 36.6278 38.6880 3.9635 42.0385 3.5996 24.8026 8.8847 20.9771 35.7922 6.8505 77.0820 70.8993 1.7914 1.1352 0.6946 2.4694 3.5106 16.7158 19.7244 8.0778 23.9337 4.3797 42.9365 3.5381 31.8709 20.9487 66.7062 4.8560 9.7706 1.6178 9.9830 15.1734 0.0595 82.7664 106.7277 24.5903 32.1113 16.9632 80.7179 57.0425 15.7218 77.0613 40.8994 6.6969 30.8933 27.8692 10.1265 6.3775 1.9500 0.9451 0.7818 3.2837 3.0616 1.7357 0.5533 3.5661
temp: 298.150 k
press: 1.00000 atm
elementType: 17 17 17 9 6 6 6 6 6 6 6 6 6 6 6 6 6 6 6 6 6 6 6 6 1 1 1 1 1 1 1 1 1 1
symmnumber: 1
zpe: 608871.4 jmol-1
zpe.correction: 0.231907 hartree
zpe.thermalcorrener: 0.251717 hartree
zpe.thermalcorrenthalpy: 0.252661 hartree
zpe.thermalcorrgfe: 0.181537 hartree
zpe.sumelectzpe: -2246.548346 hartree
zpe.sumelectthermal: -2246.528536 hartree
zpe.sumelectthermalent: -2246.527592 hartree
zpe.sumelectthermalfe: -2246.598716 hartree
dipole: -0.7222 -0.0432 1.2528
dipole: 1.4467
quadrupole: -160.1097 -162.3002 -160.5860
quadrupole: 2.0700 -8.4903 0.8061
quadrupole: 0.8890 -1.3016 0.4126 2.0700 -8.4903 0.8061
hfenergy: -2246.7802526 hartree
pointgroup: C01 [X(C20H10Cl3F1)]
dipole: 0.2814669 0.0741923 0.489124 debye
polarizability: 420.2235541|-2.1533428|319.6938266|7.8600073|-37.8200239|115.6498694 unknown
InChI: InChI=1S/C20H10Cl3F/c21-12-4-5-15-17(8-12)16(7-11-2-1-3-14(24)6-11)18-9-13(22)10-19(23)20(15)18/h1-10H
charge 0 multiplicity 1
34 atoms
Cl -4.875372 -1.80089 0.266519
Cl -4.527499 3.668565 -0.472298
Cl 2.148386 -4.420145 0.28105
F  5.279017 2.917867 -1.402801
C  -1.652692 0.782231 -0.102087
C  -0.199055 0.458305 -0.033219
C  -2.414141 -0.425604 0.060092
C  -0.129891 -1.019643 0.133201
C  -1.467479 -1.548276 0.190535
C  -2.277386 2.0341 -0.256651
C  -3.817984 -0.327487 0.056444
C  0.976147 -1.896652 0.14755
C  -1.68514 -2.937676 0.309614
C  0.776773 1.421638 -0.163178
C  -3.685406 2.068479 -0.261682
C  -4.475256 0.910772 -0.106075
C  0.725184 -3.278082 0.257577
C  -0.575942 -3.813851 0.351722
C  2.235485 1.350471 0.040173
C  3.077172 2.152988 -0.782574
C  2.832728 0.593634 1.091095
C  4.461558 2.133204 -0.566025
C  4.22897 0.612709 1.290802
C  5.071131 1.379703 0.452157
H  -1.707257 2.960221 -0.36684
H  0.423843 2.422616 -0.453151
H  2.001353 -1.534104 0.060284
H  -2.696938 -3.344941 0.358009
H  -5.565942 0.968831 -0.108232
H  -0.72138 -4.89364 0.444753
H  2.662607 2.76766 -1.588147
H  2.194975 0.027679 1.776228
H  4.667924 0.033583 2.109498
H  6.156106 1.407832 0.585455
