program: Gaussian 09
title: 000282633
version: EM64L-G09RevD.01
frameworkgroup: C1[X(C19H12Cl3N)]
method: RPBEPBE
basis: SDD
operation: Freq
keyword: #p
keyword: freq=noraman
keyword: PBEPBE/SDD
title: #p freq=noraman PBEPBE/SDD
converged: YES YES NO NO
title: Mulliken charges:
elementType: Cl Cl Cl N C C C C C C C C C C C C C C C C C C C H H H H H H H H H H H H
charge: -0.039953 -0.042094 -0.051858 -0.106276 -0.430331 0.299497 0.266789 0.337803 0.204757 -0.381871 -0.396356 -0.316422 -0.383477 -0.448743 -0.446512 -0.132985 -0.111009 -0.266902 -0.223204 0.212153 0.206927 -0.490843 -0.483186 0.287695 0.274750 0.295572 0.273543 0.230500 0.268965 0.216863 0.274364 0.281545 0.257889 0.280426 0.281982
chargesum: 0.00000
title: Mulliken charges with hydrogens summed into heavy atoms:
elementType: Cl Cl Cl N C C C C C C C C C C C C C C C C C C C
charge: -0.039953 -0.042094 -0.051858 -0.106276 -0.142637 0.299497 0.266789 0.337803 0.204757 -0.107122 -0.100783 -0.316422 -0.109934 0.050723 0.044716 -0.132985 -0.111009 0.014643 0.034685 0.212153 0.206927 -0.210417 -0.201204
polarizability: 3.30181086e+02 -5.84451963e+00 2.60899574e+02 1.73336197e+00 -1.28430693e+01 1.55917429e+02
1716.lowfreq: -5.5936 -2.7227 -0.0021 -0.0018 -0.0016 4.9364 19.3939 26.8401 37.2196
frequency: 19.3538 26.8311 37.2182 49.0917 70.4064 81.4768 101.9810 110.7624 130.3756 145.6870 153.7865 172.7323 194.2121 216.4798 224.9754 242.6678 250.0660 282.3515 309.9100 319.5349 325.9180 342.2564 371.5964 382.8892 389.3732 406.5130 442.0538 481.8613 526.1273 538.8452 562.4021 566.4884 568.2363 596.8362 633.9330 635.9138 639.3877 669.8901 673.2212 680.2411 694.1208 747.2317 765.1571 789.8324 807.0608 834.2305 863.7805 875.2450 886.2425 905.3324 912.0055 932.7274 963.9666 971.3090 979.0648 989.4429 990.9147 1061.6520 1082.7306 1106.2419 1113.5152 1132.3669 1144.1743 1178.6489 1198.8916 1203.9800 1218.7465 1244.4351 1245.8380 1274.7509 1316.4458 1350.7491 1357.6463 1361.7149 1368.4725 1407.9633 1420.4624 1425.6564 1456.7881 1468.5442 1479.1387 1560.2485 1583.2742 1598.7366 1607.4913 2144.3924 2146.2815 2864.7661 2873.2670 2980.7396 3009.0002 3023.0257 3164.3163 3170.5881 3177.3878 3184.5701 3186.7452 3423.3713 3425.1619
redmass: 6.6414 10.6604 6.1970 9.0372 4.3290 5.8482 6.2312 5.7291 5.9994 4.7328 4.6397 16.9384 5.2613 5.0105 6.6172 6.7729 10.7348 6.1434 4.2812 2.8800 2.7270 6.6672 8.4592 6.8860 7.2405 7.6440 3.5400 5.2394 5.2220 6.7358 6.7163 6.4726 3.5893 5.8132 1.2306 1.2511 5.3881 1.2818 1.2597 4.7742 6.4229 6.8075 4.5873 7.6708 4.0926 1.4802 1.4245 2.1278 1.7949 3.7893 2.0567 2.5617 1.4060 3.4206 1.9727 3.0887 3.9014 1.9539 1.8697 2.7191 3.7597 1.9307 4.3144 1.5129 1.8036 1.8410 1.1150 1.2281 1.7424 1.8448 1.3739 3.4635 1.4147 1.4380 7.2179 4.1072 4.2980 2.9547 1.0796 4.3345 1.0956 8.4281 8.4111 9.2134 7.7343 6.0142 6.0168 1.0708 1.0695 1.0813 1.0846 1.0866 1.0897 1.0933 1.0928 1.0934 1.0961 1.1599 1.1599
irintensity: 0.0546 0.0292 0.0301 0.1449 0.5135 0.3663 0.4919 0.3211 0.1824 1.4038 0.9290 0.8435 0.0690 0.6594 1.6178 1.5486 1.3337 3.6737 1.9764 3.2593 11.8853 3.3304 9.1887 10.9133 8.0664 11.8451 4.5307 8.9133 3.2009 5.4070 1.0526 1.4963 0.0490 0.5536 58.4776 81.4193 7.9000 49.5437 64.7620 17.4809 44.6774 9.5343 15.1324 36.9633 9.3741 36.3477 24.5374 16.1254 17.5858 34.1538 22.6676 4.0579 0.0829 7.2906 2.9983 7.1831 17.8520 23.3317 12.7264 18.5959 40.2559 12.8927 98.4069 41.3805 9.1867 8.7825 9.6655 16.8083 12.5952 0.7354 3.2437 11.1348 10.3411 14.9271 6.7870 88.0748 13.8710 90.7987 5.3235 9.7250 9.3179 59.9516 8.8647 25.6798 23.1883 0.1131 0.9102 50.3906 53.1740 14.0999 9.3801 4.0398 1.2762 0.2490 0.8989 0.8755 3.3401 73.2112 70.6057
temp: 298.150 k
press: 1.00000 atm
elementType: 17 17 17 7 6 6 6 6 6 6 6 6 6 6 6 6 6 6 6 6 6 6 6 1 1 1 1 1 1 1 1 1 1 1 1
symmnumber: 1
zpe: 641344.7 jmol-1
zpe.correction: 0.244275 hartree
zpe.thermalcorrener: 0.265888 hartree
zpe.thermalcorrenthalpy: 0.266832 hartree
zpe.thermalcorrgfe: 0.191535 hartree
zpe.sumelectzpe: -2164.429412 hartree
zpe.sumelectthermal: -2164.407799 hartree
zpe.sumelectthermalent: -2164.406855 hartree
zpe.sumelectthermalfe: -2164.482152 hartree
dipole: -0.8172 1.2359 0.0562
dipole: 1.4827
quadrupole: -168.1499 -143.6838 -148.7105
quadrupole: 0.3339 1.6426 -1.0594
quadrupole: -14.6351 9.8309 4.8043 0.3339 1.6426 -1.0594
hfenergy: -2164.6736873 hartree
pointgroup: C01 [X(C19H12Cl3N1)]
dipole: 0.5118503 -0.2796879 0.0083998 debye
polarizability: 319.4666278|25.657878|271.0181853|-10.9063965|10.9967192|156.513276 unknown
InChI: InChI=1S/C19H12Cl3N/c1-3-7-23(8-4-2)19-15-9-12(20)5-6-14(15)18-16(19)10-13(21)11-17(18)22/h1-2,5-6,9-11,19H,7-8H2
charge 0 multiplicity 1
35 atoms
Cl -0.34404 4.469205 0.578465
Cl 4.701003 2.343777 -0.219311
Cl -5.225459 -1.156812 -0.364516
N  0.45753 -1.839537 0.163405
C  0.154858 -0.624413 -0.631716
C  0.977975 0.655991 -0.364814
C  -1.272846 -0.127165 -0.411333
C  0.101759 1.748802 -0.058435
C  -1.295088 1.26367 -0.096432
C  2.370897 0.817656 -0.431753
C  -2.449461 -0.885726 -0.492742
C  0.682458 3.007117 0.195207
C  -2.532425 1.9150 0.118272
C  0.430014 -1.622908 1.636179
C  1.639523 -2.638643 -0.264723
C  2.89791 2.098685 -0.156801
C  -3.668619 -0.212142 -0.268672
C  2.080045 3.201128 0.157563
C  -3.729264 1.166352 0.027748
C  0.358224 -2.884471 2.396868
C  1.663374 -2.915993 -1.71031
C  0.309622 -3.91837 3.06589
C  1.722895 -3.157733 -2.917539
H  0.288133 -0.919879 -1.6924
H  3.036137 -0.003565 -0.708018
H  -2.41437 -1.957236 -0.706838
H  -2.577998 2.97999 0.355398
H  1.317489 -1.044501 1.993443
H  -0.463782 -1.013487 1.865913
H  2.607102 -2.15915 0.026404
H  1.594339 -3.597005 0.287535
H  2.512586 4.183389 0.361356
H  -4.697547 1.647824 0.191987
H  0.255237 -4.821846 3.645762
H  1.769386 -3.377501 -3.968942
