program: Gaussian 09
title: 000282615
version: EM64L-G09RevD.01
frameworkgroup: C1[X(C21H16N2O2)]
method: RPBEPBE
basis: SDD
operation: Freq
keyword: #p
keyword: freq=noraman
keyword: PBEPBE/SDD
title: #p freq=noraman PBEPBE/SDD
converged: YES YES NO NO
title: Mulliken charges:
elementType: O O N N C C C C C C C C C C C C C C C C C C C C C H H H H H H H H H H H H H H H H
charge: -0.266715 -0.262628 -0.403623 -0.099826 0.197084 0.326509 0.022282 0.260256 -0.545924 0.561367 -0.048728 -0.352449 -0.378798 -0.491559 0.209234 0.157304 -0.369616 -0.467806 -0.329517 -0.325807 -0.270133 -0.247662 -0.274612 -0.237535 -0.204823 0.223638 0.278957 0.297692 0.195821 0.226844 0.276249 0.236381 0.214882 0.256582 0.250013 0.231131 0.230871 0.225010 0.226934 0.232281 0.240437
chargesum: 0.00000
title: Mulliken charges with hydrogens summed into heavy atoms:
elementType: O O N N C C C C C C C C C C C C C C C C C C C C C
charge: -0.266715 -0.262628 -0.105932 -0.099826 0.197084 0.326509 0.022282 0.260256 -0.043329 0.561367 -0.048728 -0.156629 -0.151954 -0.215309 0.209234 0.157304 -0.154734 -0.231425 -0.072934 -0.075794 -0.039002 -0.016791 -0.049601 -0.010601 0.267896
polarizability: 3.40523916e+02 -2.80761603e+01 2.73594499e+02 -3.42028510e+01 -6.94468345e-01 1.82424082e+02
1716.lowfreq: -9.6142 -4.4087 -2.6752 -0.0005 -0.0002 0.0005 4.3769 20.5969 26.9557
frequency: -2.8268 20.5543 26.9420 54.0750 84.1901 95.2449 111.2952 121.9327 161.8353 199.5565 216.3341 235.0336 241.9125 257.5283 309.0759 324.8121 380.0914 400.4515 410.9942 416.6271 437.6468 441.8841 452.9684 468.5950 482.6625 519.2590 535.1727 567.5672 577.4683 606.4277 611.3202 627.2307 660.0070 663.2887 676.1975 701.3128 720.9881 728.8827 750.5310 766.1529 773.6549 776.2541 790.6640 792.2548 815.0684 836.6993 864.7796 875.3588 875.9222 890.4942 918.9304 931.8826 945.2103 951.3579 973.5637 985.4893 985.7796 989.5585 991.9312 1028.9989 1037.1169 1051.9951 1057.9310 1071.5775 1099.1420 1122.6630 1128.9462 1135.4594 1151.0095 1169.9915 1180.2066 1186.6170 1216.6118 1241.7235 1246.6814 1264.1734 1275.4626 1290.1213 1309.9944 1322.8823 1353.4880 1363.7405 1380.2601 1391.3954 1405.5774 1428.1004 1439.4293 1442.3767 1455.8331 1467.7709 1475.8189 1481.1697 1485.7986 1515.0043 1534.2158 1561.3884 1584.5358 1612.8556 1616.1904 1621.6342 1629.7228 2974.2775 2997.4886 3041.1520 3109.3416 3122.4084 3126.4380 3134.4078 3135.1931 3138.4333 3153.3167 3156.3773 3167.8682 3169.6777 3171.6881 3179.9500 3596.0413
redmass: 5.9356 5.5640 5.7600 4.2869 2.6071 4.1942 4.7331 5.5063 4.3741 4.8131 5.4277 3.8985 5.0093 5.1044 4.6869 4.1513 3.9008 2.5070 6.3796 2.9950 3.1518 5.4073 3.4359 1.9170 5.4716 3.1094 4.8959 3.3454 6.0365 5.9320 6.6218 4.8383 4.4706 5.4193 9.0042 5.7491 4.4710 2.2481 5.2407 1.5312 1.7078 5.6351 3.9951 2.6642 1.4599 8.2178 1.5447 1.9206 2.1440 2.1305 3.9278 1.3696 1.4132 1.3725 4.9519 1.4758 2.3512 1.3358 7.4074 3.0610 2.1285 2.3229 3.4762 1.5008 2.6059 1.5548 1.0896 1.4835 2.0783 1.1002 1.7133 1.1457 1.2566 1.4947 5.3427 1.4848 1.5764 2.5733 2.1707 1.8165 1.8265 1.2836 4.1988 6.6376 3.2024 2.5884 2.9875 4.4476 2.4946 1.6498 2.5354 1.2598 1.5201 2.4512 3.7032 5.8952 7.9970 7.8160 6.0953 6.3931 8.0795 1.0637 1.0613 1.0970 1.1099 1.0859 1.0847 1.0899 1.0885 1.0892 1.0942 1.0941 1.0999 1.0993 1.0931 1.0954 1.0765
irintensity: 0.1060 0.2085 1.0029 0.9091 11.4165 2.0408 4.1624 2.5974 0.1949 1.5336 0.3559 0.9592 2.0015 0.5347 0.3794 0.8786 20.5995 16.9038 0.7039 9.6005 24.8685 7.8432 7.3004 32.8931 16.9040 0.8047 14.4419 9.0588 0.2684 0.8334 8.8345 6.9978 10.5914 20.2476 1.1806 3.2880 3.0459 67.7664 13.9783 95.8361 20.8826 18.8293 3.5751 3.0174 40.4514 33.6908 0.3379 2.4814 10.0921 14.9798 5.9820 1.2163 0.0751 2.9093 135.7363 0.5147 6.5068 0.0025 4.7623 0.2742 11.9925 4.8983 22.3694 7.1186 23.7835 23.5478 5.5636 1.4154 4.7795 0.6989 25.4397 1.0695 61.7258 29.4951 211.0155 0.9625 5.5342 21.5855 59.1384 27.8067 20.3864 0.9993 2.7464 12.5623 31.9054 101.3160 30.9234 50.3550 39.7672 111.2319 19.8330 9.6669 52.5790 103.9572 424.0535 33.1849 170.5490 3.6265 25.8645 4.2630 2.6575 71.4493 129.0457 25.5190 30.0296 9.8249 1.0985 10.9147 15.1100 9.4037 4.4957 43.9274 47.4688 19.4210 1.8457 6.5455 44.1508
temp: 298.150 k
press: 1.00000 atm
elementType: 8 8 7 7 6 6 6 6 6 6 6 6 6 6 6 6 6 6 6 6 6 6 6 6 6 1 1 1 1 1 1 1 1 1 1 1 1 1 1 1 1
symmnumber: 1
zpe: 832831.6 jmol-1
zpe.correction: 0.317209 hartree
zpe.thermalcorrener: 0.335819 hartree
zpe.thermalcorrenthalpy: 0.336764 hartree
zpe.thermalcorrgfe: 0.269161 hartree
zpe.sumelectzpe: -1068.075112 hartree
zpe.sumelectthermal: -1068.056502 hartree
zpe.sumelectthermalent: -1068.055557 hartree
zpe.sumelectthermalfe: -1068.123159 hartree
dipole: -0.4439 2.1473 -0.1484
dipole: 2.1977
quadrupole: -130.4637 -132.2287 -140.0313
quadrupole: 4.7320 -3.7739 1.7662
quadrupole: 3.7775 2.0125 -5.7900 4.7320 -3.7739 1.7662
hfenergy: -1068.392321 hartree
pointgroup: C01 [X(C21H16N2O2)]
dipole: 0.2408666 -0.8065986 0.1974508 debye
polarizability: 342.0765892|-10.0608856|263.6846162|44.159581|-21.9107043|190.7812912 unknown
InChI: InChI=1S/C21H16N2O2/c1-2-7-17-15(5-1)16-6-3-4-8-18(16)23-21(17)22-12-14-9-10-19-20(11-14)25-13-24-19/h1-11,22H,12-13H2
charge 0 multiplicity 1
41 atoms
O  4.354412 -0.114818 -2.11763
O  6.293321 0.302306 -0.769558
N  0.270239 -0.191863 1.426517
N  -1.364439 1.106565 0.384176
C  -1.779805 -1.320383 0.628917
C  -3.055371 -1.189735 -0.026407
C  -0.966413 -0.101585 0.803204
C  -3.48778 0.133362 -0.483974
C  1.145249 0.967501 1.656569
C  2.537648 0.78543 1.061946
C  -2.598834 1.242971 -0.248992
C  -1.353856 -2.604121 1.080726
C  -3.848989 -2.36373 -0.201769
C  2.673554 0.397876 -0.306091
C  3.967153 0.284229 -0.811083
C  5.110794 0.531728 -0.018171
C  -4.727686 0.380495 -1.142311
C  3.688688 1.024116 1.851298
C  -2.977454 2.550785 -0.677451
C  5.005065 0.901713 1.322654
C  -2.15266 -3.741265 0.896199
C  -3.411317 -3.616386 0.247857
C  -5.08506 1.672394 -1.557251
C  -4.202366 2.765391 -1.322642
C  5.824027 0.101366 -2.166434
H  1.2315 1.172312 2.742615
H  0.620802 1.82522 1.197036
H  0.612941 -1.103516 1.721578
H  -0.389623 -2.731381 1.586166
H  -4.821258 -2.289483 -0.697682
H  1.794197 0.204624 -0.926615
H  3.566273 1.316781 2.900476
H  -5.422053 -0.444585 -1.332931
H  -2.27728 3.368973 -0.482792
H  5.891162 1.083014 1.936008
H  -1.809297 -4.719234 1.249544
H  -4.040188 -4.501109 0.100428
H  -6.042827 1.840049 -2.061617
H  -4.482794 3.773628 -1.647633
H  6.034548 1.016372 -2.752314
H  6.305779 -0.797407 -2.580469
