program: Gaussian 09
title: 000028132
version: EM64L-G09RevD.01
frameworkgroup: C1[X(C10H13NO3)]
method: RPBEPBE
basis: SDD
operation: Freq
keyword: #p
keyword: freq=noraman
keyword: PBEPBE/SDD
title: #p freq=noraman PBEPBE/SDD
converged: YES YES NO NO
title: Mulliken charges:
elementType: O O O N C C C C C C C C C C H H H H H H H H H H H H H
charge: -0.225603 -0.491689 -0.417543 -0.083482 -0.438569 0.116804 0.340309 -0.493931 -0.641469 -0.613709 -0.346375 0.175790 -0.336119 0.156901 0.202102 0.239011 0.277602 0.279161 0.175556 0.218256 0.228120 0.183543 0.222735 0.246023 0.255258 0.381082 0.390237
chargesum: 0.00000
title: Mulliken charges with hydrogens summed into heavy atoms:
elementType: O O O N C C C C C C C C C C
charge: -0.225603 -0.110607 -0.027306 -0.083482 0.002544 0.116804 0.340309 -0.216329 0.031504 0.020689 -0.100352 0.175790 -0.080861 0.156901
polarizability: 2.03363960e+02 -4.81001860e+00 1.29542858e+02 1.45293643e+00 -3.74760333e+00 6.92812684e+01
1716.lowfreq: -15.2819 -5.2338 -0.0008 0.0002 0.0004 2.9939 32.2708 49.7071 89.8915
frequency: 31.7327 49.6802 89.8819 110.4464 117.9535 209.0277 213.7189 228.8194 240.7824 247.0252 282.9472 294.2773 314.8525 320.5892 355.1876 389.3639 436.3826 437.1564 511.6366 516.9541 526.3998 565.7789 612.6521 629.3052 725.9932 750.8808 774.7614 812.6947 826.8590 884.3527 892.6159 938.3628 971.8012 1005.6473 1037.9053 1066.5331 1085.7314 1092.1607 1130.8768 1133.2203 1149.9989 1174.7783 1182.7784 1243.0098 1264.3981 1282.5002 1284.3681 1330.4152 1354.2788 1408.8763 1415.9976 1426.7453 1443.7641 1451.5818 1460.9740 1468.8334 1481.7705 1490.7965 1516.9969 1579.4143 1607.1385 1624.3492 2782.8302 2838.1863 2853.7098 3000.5924 3016.3081 3038.2576 3076.8476 3111.1061 3128.3237 3153.6319 3177.0250 3513.7774 3623.2752
redmass: 4.5832 2.9581 3.6506 7.2880 3.2115 5.1765 1.8053 1.8329 1.5997 1.8951 4.8869 1.4426 2.5605 2.4461 3.3988 5.6811 3.2610 2.3700 4.1117 3.7626 1.1096 6.0685 6.4570 3.6800 3.8825 6.4348 5.1888 1.4373 4.7975 4.5525 1.4406 1.4118 2.1334 2.5736 1.5638 2.0266 2.0296 1.2587 1.3765 1.3244 1.8825 1.3419 1.7477 2.5994 1.8290 2.6500 1.8673 1.7196 1.8154 3.4926 1.1429 1.1281 2.4178 1.5031 1.0624 1.0923 1.0573 1.0483 3.3458 8.2356 6.5743 7.6095 1.0698 1.0577 1.0578 1.0832 1.0716 1.0739 1.1006 1.0987 1.0916 1.0882 1.0966 1.0648 1.0666
irintensity: 2.4370 1.0514 2.3231 1.3918 0.5197 0.0752 6.7627 0.1128 4.3628 4.2762 4.2506 128.6853 13.8335 60.4699 1.5979 3.4865 5.4027 0.9033 5.0012 10.2350 134.3341 11.4580 15.5197 15.1930 1.7358 44.8656 4.4310 28.4933 21.5076 64.8212 26.9456 1.6992 1.4743 70.6029 25.9161 35.9081 165.5819 3.5122 27.7819 25.1710 118.0138 132.8760 216.5325 51.8426 146.6799 0.0291 56.6646 1.0272 26.8646 103.8844 7.2247 7.4731 51.5544 9.2554 31.1141 10.4016 7.4025 35.1071 62.1754 153.8065 81.7273 11.8136 94.5867 72.2055 237.5473 22.7628 48.3031 44.3200 39.7301 12.4789 9.4851 6.4745 5.4086 126.3334 62.4082
temp: 298.150 k
press: 1.00000 atm
elementType: 8 8 8 7 6 6 6 6 6 6 6 6 6 6 1 1 1 1 1 1 1 1 1 1 1 1 1
symmnumber: 1
zpe: 561171.7 jmol-1
zpe.correction: 0.213739 hartree
zpe.thermalcorrener: 0.228063 hartree
zpe.thermalcorrenthalpy: 0.229008 hartree
zpe.thermalcorrgfe: 0.172382 hartree
zpe.sumelectzpe: -668.200685 hartree
zpe.sumelectthermal: -668.186361 hartree
zpe.sumelectthermalent: -668.185416 hartree
zpe.sumelectthermalfe: -668.242042 hartree
dipole: 0.8554 -0.6918 0.6922
dipole: 1.2998
quadrupole: -77.7128 -78.1876 -86.2452
quadrupole: 16.8595 -4.0345 1.3370
quadrupole: 3.0024 2.5276 -5.5300 16.8595 -4.0345 1.3370
hfenergy: -668.4144241 hartree
pointgroup: C01[X(C10H13N1O3)]
dipole: -0.3574923 -0.2779965 -0.2375325 debye
polarizability: 202.754331|4.7698007|129.6653824|-9.3428553|1.8157823|69.7683727 unknown
InChI: InChI=1S/C10H13NO3/c1-11(2)6-10(14)7-3-4-8(12)9(13)5-7/h3-5,12-13H,6H2,1-2H3
charge 0 multiplicity 1
27 atoms
O  1.420706 1.7982 0.004778
O  -3.729704 1.588468 0.286562
O  -4.352057 -1.01845 0.113474
N  3.622073 -0.006724 -0.171376
C  2.246624 -0.509623 -0.197113
C  1.150587 0.563399 -0.067117
C  -0.274021 0.093834 -0.031893
C  -1.286409 1.087133 0.104202
C  3.975476 0.836367 -1.331753
C  4.599845 -1.087492 0.058599
C  -0.656471 -1.273061 -0.118929
C  -2.630795 0.710653 0.152584
C  -2.014597 -1.648719 -0.070587
C  -3.009115 -0.66062 0.064918
H  2.019465 -1.102176 -1.127981
H  2.115803 -1.214602 0.648339
H  -0.967374 2.13503 0.16965
H  3.296658 1.701352 -1.37592
H  3.925984 0.280739 -2.304245
H  5.005658 1.213669 -1.205591
H  5.608511 -0.650372 0.165109
H  4.640511 -1.841577 -0.769987
H  4.361705 -1.621271 0.996741
H  0.098516 -2.057141 -0.227677
H  -2.322971 -2.695784 -0.137716
H  -3.44627 2.531166 0.355022
H  -4.902137 -0.195696 0.211108
