program: Gaussian 09
title: 000282566
version: EM64L-G09RevD.01
frameworkgroup: C1[X(C15H11ClOS)]
method: RPBEPBE
basis: SDD
operation: Freq
keyword: #p
keyword: freq=noraman
keyword: PBEPBE/SDD
title: #p freq=noraman PBEPBE/SDD
converged: YES YES NO NO
title: Mulliken charges:
elementType: Cl S O C C C C C C C C C C C C C C C H H H H H H H H H H H
charge: 0.001607 0.315025 -0.291855 0.393025 0.387819 0.387782 -0.589699 -0.424474 -0.357777 -0.297724 -0.410246 -0.407826 -0.113337 -0.240508 -0.247916 -0.258774 -0.057794 -0.445206 0.262080 0.235628 0.248503 0.230978 0.231231 0.239936 0.238134 0.228162 0.228165 0.251535 0.263525
chargesum: 0.00000
title: Mulliken charges with hydrogens summed into heavy atoms:
elementType: Cl S O C C C C C C C C C C C C C C C
charge: 0.001607 0.315025 -0.291855 0.393025 0.387819 0.387782 -0.327618 -0.188846 -0.109273 0.164485 -0.170310 -0.169692 -0.113337 -0.012346 -0.019751 -0.007239 0.205731 -0.445206
polarizability: 3.18504383e+02 -1.33298976e+01 2.02349307e+02 1.08505752e-01 7.26716127e-02 7.38141441e+01
1716.lowfreq: -48.6964 -2.7595 0.0017 0.0019 0.0025 2.3229 7.4254 25.2289 41.0586
frequency: -48.5850 25.1905 41.0584 54.0856 116.8729 136.3069 141.3948 186.8454 202.2036 256.6640 261.7426 298.2547 346.1783 393.6859 403.5060 453.9665 458.3370 474.0230 508.4528 527.0639 529.3097 541.5813 605.6033 622.1113 635.1005 645.4252 701.3313 742.5547 755.3082 758.4384 774.7927 791.8082 810.3043 861.3456 873.0977 877.8443 902.0486 939.6073 944.5094 945.2254 966.7328 989.5138 1005.8116 1009.3520 1021.8427 1058.0343 1124.9000 1163.7909 1167.2932 1173.1088 1191.4943 1192.6941 1206.5696 1241.0482 1260.7662 1273.4707 1292.9963 1357.7031 1361.8307 1411.3317 1423.1464 1439.9915 1460.7338 1473.6198 1495.1100 1516.1961 1567.9819 1579.8387 1605.9044 1644.1077 2935.9208 2986.7984 3119.6421 3125.6921 3127.8910 3143.2457 3153.2647 3162.3868 3164.4142 3165.3432 3199.1907
redmass: 4.6356 6.6910 9.0205 5.1729 4.4774 7.8341 5.2351 3.6794 10.9991 5.3254 7.5778 5.1605 5.4868 10.6638 3.1665 5.8701 5.5776 2.4491 6.9237 6.5812 3.4851 2.9501 7.2053 6.4780 7.3348 2.7847 7.1903 6.2667 1.3213 4.8820 2.2803 1.2186 1.4545 1.4501 5.5580 1.4009 1.7421 4.7548 1.3627 4.8439 1.4147 1.3404 4.8754 1.5589 2.2481 1.6606 1.7756 1.5470 1.3852 1.1150 3.5321 1.0567 1.3398 2.1279 2.2157 1.7347 2.3049 1.7170 1.6109 4.8488 3.3526 3.9092 1.9087 1.3070 6.5316 3.6180 6.4821 7.5421 5.6762 6.9752 1.0543 1.1060 1.0861 1.0887 1.0885 1.0950 1.0920 1.1000 1.0948 1.0931 1.0989
irintensity: 1.1155 0.6630 0.0353 2.3674 2.7437 0.8257 3.3560 0.6222 0.2609 1.0315 1.2766 0.9303 2.5519 4.6755 0.2359 21.9891 0.7448 27.0151 2.2783 5.1238 0.0820 0.0317 4.1827 3.7762 6.7916 0.3423 7.0510 6.4007 36.6060 1.4928 4.3625 55.6982 69.3571 38.4386 3.2931 0.4077 20.4180 1.6586 0.0590 84.8306 8.3554 0.0685 105.8483 0.0528 0.1354 23.3447 35.6481 147.7848 35.7349 5.5271 19.2040 0.4491 14.9425 46.6820 242.0074 6.2505 2.5981 32.2730 25.5034 0.3746 3.2440 1.9818 67.0694 1.8254 46.9095 80.7534 1.2490 7.3617 60.4055 99.5425 31.9104 26.3551 3.6206 1.3257 10.7040 31.5064 6.0657 46.8887 5.9963 6.9169 1.0673
temp: 298.150 k
press: 1.00000 atm
elementType: 17 16 8 6 6 6 6 6 6 6 6 6 6 6 6 6 6 6 1 1 1 1 1 1 1 1 1 1 1
symmnumber: 1
zpe: 559277.4 jmol-1
zpe.correction: 0.213018 hartree
zpe.thermalcorrener: 0.227584 hartree
zpe.thermalcorrenthalpy: 0.228528 hartree
zpe.thermalcorrgfe: 0.169448 hartree
zpe.sumelectzpe: -1510.262670 hartree
zpe.sumelectthermal: -1510.248104 hartree
zpe.sumelectthermalent: -1510.247160 hartree
zpe.sumelectthermalfe: -1510.306240 hartree
dipole: 1.3458 3.1806 0.0172
dipole: 3.4537
quadrupole: -112.4304 -102.5811 -125.8489
quadrupole: -8.0313 -0.0172 0.0093
quadrupole: 1.1897 11.0390 -12.2288 -8.0313 -0.0172 0.0093
hfenergy: -1510.4756877 hartree
pointgroup: C01 [X(C15H11Cl1O1S1)]
dipole: -0.3886877 1.2978549 -0.1038345 debye
polarizability: 318.6713225|-1.3959887|199.643747|-18.0775307|-12.2054124|76.3527643 unknown
InChI: InChI=1S/C15H11ClOS/c16-15-8-7-14(18-15)10-17-13-6-5-11-3-1-2-4-12(11)9-13/h1-9H,10H2
charge 0 multiplicity 1
29 atoms
Cl 6.204491 -2.562609 -0.357826
S  3.333213 -1.378412 -0.25229
O  0.783114 -0.090997 -0.185315
C  -2.863768 -0.661745 0.135495
C  -3.395019 0.686197 0.045231
C  -0.589215 0.221887 -0.114727
C  -1.452656 -0.865265 0.052453
C  -2.478443 1.771985 -0.125083
C  -1.100495 1.557883 -0.205197
C  1.734459 1.008663 -0.370844
C  -3.780565 -1.754839 0.305637
C  -4.812858 0.8872 0.128464
C  3.114606 0.408931 -0.419059
C  -5.155362 -1.526835 0.382762
C  -5.678608 -0.195338 0.293823
C  4.328575 1.056134 -0.581372
C  5.474624 0.176367 -0.58159
C  5.112967 -1.145515 -0.417222
H  -1.031891 -1.873823 0.118278
H  -2.872117 2.793009 -0.193995
H  -0.427609 2.410334 -0.335933
H  1.65291 1.728332 0.471443
H  1.511394 1.548055 -1.31599
H  -3.383151 -2.774377 0.374012
H  -5.208147 1.907953 0.059538
H  -5.844361 -2.368856 0.51221
H  -6.760175 -0.033667 0.356233
H  4.415711 2.139718 -0.69956
H  6.506376 0.512332 -0.697779
