program: Gaussian 09
title: 000282565
version: EM64L-G09RevD.01
frameworkgroup: C1[X(C15H11NO2)]
method: RPBEPBE
basis: SDD
operation: Freq
keyword: #p
keyword: freq=noraman
keyword: PBEPBE/SDD
title: #p freq=noraman PBEPBE/SDD
converged: YES YES NO NO
title: Mulliken charges:
elementType: O O N C C C C C C C C C C C C C C C H H H H H H H H H H H
charge: -0.202475 -0.226364 0.141935 -0.135445 -0.176473 -0.524408 0.312221 0.320447 0.169588 0.160256 -0.431653 -0.453517 -0.400969 -0.390700 -0.257964 -0.248037 -0.231000 -0.235718 0.302188 0.269267 0.291865 0.286601 0.243165 0.245974 0.248190 0.230971 0.230235 0.230337 0.231484
chargesum: 0.00000
title: Mulliken charges with hydrogens summed into heavy atoms:
elementType: O O N C C C C C C C C C C C C C C C
charge: -0.202475 -0.226364 0.141935 -0.135445 0.125715 0.036724 0.312221 0.320447 0.169588 0.160256 -0.145052 -0.210352 -0.154995 -0.142510 -0.026993 -0.017802 -0.000663 -0.004235
polarizability: 2.31531044e+02 -1.75762161e+01 2.11247018e+02 1.24635044e+01 6.63490452e+00 1.01179256e+02
1716.lowfreq: -5.2749 -4.8671 0.0004 0.0005 0.0006 6.8092 50.2479 61.5661 90.6560
frequency: 50.2441 61.5621 90.6461 117.9409 149.8315 159.0018 189.6130 211.5499 279.8976 332.8065 374.6556 401.4730 428.5913 441.0437 464.5018 479.3316 511.1902 570.0989 580.5261 582.0271 617.7523 631.5053 669.5101 701.2509 733.6136 750.9319 753.2533 759.8281 793.8698 799.4659 815.7869 820.7273 877.2539 889.0415 945.1496 953.1513 956.6852 986.5564 988.4735 991.9595 995.9151 1020.5802 1026.0018 1060.3851 1075.7151 1091.8222 1093.8197 1115.8108 1141.8788 1173.8392 1178.1150 1222.6281 1231.7463 1242.1329 1272.3326 1303.7585 1311.2298 1344.8575 1380.5220 1403.1456 1408.7152 1440.3010 1441.5723 1446.9424 1469.8733 1487.1651 1588.5684 1593.3110 1618.4658 1620.1509 3100.9684 3115.2630 3128.4540 3131.7575 3141.7658 3146.0463 3159.3860 3164.9424 3176.5633 3184.7163 3211.5385
redmass: 7.8620 7.1208 5.4176 5.6203 4.4176 4.5323 6.2108 4.9946 4.2361 3.3748 4.0311 6.2051 3.2990 6.3341 3.3246 4.6553 5.2801 3.3415 4.4342 4.9271 6.8310 3.6399 5.6895 5.4877 4.1323 1.5574 4.9450 1.7170 2.3988 2.7139 3.0437 2.9164 1.4271 1.5133 1.4312 1.9146 1.4109 1.4844 3.0439 1.3998 5.7358 2.3369 2.2274 1.6618 1.6020 1.6653 1.6183 1.5888 1.8709 1.0793 1.1038 2.2505 7.4035 2.1139 1.7344 1.8994 1.7114 4.0822 8.0293 3.7122 2.2746 2.2375 1.5445 2.6113 2.7377 4.0256 6.6022 6.7315 7.2658 7.1101 1.0563 1.0887 1.0861 1.0874 1.0911 1.0936 1.0965 1.1000 1.0968 1.0927 1.1146
irintensity: 0.7428 1.4700 0.4323 1.5943 5.0715 1.5401 0.4299 0.2146 0.5040 0.3365 1.3209 0.3096 7.7634 4.0426 0.8420 9.6070 0.3811 0.3038 4.1372 1.1254 3.5344 12.5577 22.2329 5.4959 4.9572 114.0619 0.1105 52.5396 2.4048 14.2554 31.5937 7.8934 0.9334 0.7851 1.4901 22.2948 2.6739 1.1530 2.8570 0.6204 2.0513 8.5562 3.6788 3.4193 1.5401 6.1019 26.0929 1.7333 1.6339 0.2786 1.5364 6.4022 203.2058 28.2972 25.1051 3.5626 8.5498 13.7691 10.9032 19.4611 92.7835 28.0450 28.3270 14.4974 6.3877 2.9709 0.4670 0.6781 2.1158 3.3328 3.4811 9.4332 2.7786 1.8238 9.4031 20.3802 28.9089 31.5672 9.6407 0.5899 1.2707
temp: 298.150 k
press: 1.00000 atm
elementType: 8 8 7 6 6 6 6 6 6 6 6 6 6 6 6 6 6 6 1 1 1 1 1 1 1 1 1 1 1
symmnumber: 1
zpe: 576450.5 jmol-1
zpe.correction: 0.219558 hartree
zpe.thermalcorrener: 0.233155 hartree
zpe.thermalcorrenthalpy: 0.234099 hartree
zpe.thermalcorrgfe: 0.178932 hartree
zpe.sumelectzpe: -782.064028 hartree
zpe.sumelectthermal: -782.050432 hartree
zpe.sumelectthermalent: -782.049488 hartree
zpe.sumelectthermalfe: -782.104654 hartree
dipole: 3.8128 0.3096 -2.2696
dipole: 4.4479
quadrupole: -106.0171 -89.7612 -109.4717
quadrupole: -6.7728 9.1772 8.4293
quadrupole: -4.2671 11.9888 -7.7217 -6.7728 9.1772 8.4293
hfenergy: -782.2835868 hartree
pointgroup: C01 [X(C15H11N1O2)]
dipole: -1.4935761 -0.0769668 -0.9086521 debye
polarizability: 232.1758081|-16.3099616|211.1408279|-12.9556229|1.3056218|100.6406821 unknown
InChI: InChI=1S/C15H11NO2/c17-16(18)14-9-15(14)12-7-3-1-5-10(12)11-6-2-4-8-13(11)15/h1-8,14H,9H2
charge 0 multiplicity 1
29 atoms
O  2.609987 2.091985 1.948095
O  3.418568 1.088995 0.060982
N  2.486974 1.685513 0.729578
C  0.309678 0.729861 -0.491862
C  1.180592 1.925381 0.084162
C  1.020024 1.732899 -1.408611
C  0.648256 -0.735568 -0.373348
C  -1.168425 0.811419 -0.209981
C  -0.538536 -1.448083 -0.006306
C  -1.658903 -0.493694 0.095141
C  1.854548 -1.426659 -0.596201
C  -2.026447 1.924704 -0.210881
C  -0.512495 -2.847056 0.161777
C  -3.020971 -0.6856 0.405408
C  1.874613 -2.833711 -0.423471
C  -3.395687 1.728786 0.099068
C  0.705586 -3.536921 -0.043959
C  -3.885651 0.435005 0.406494
H  0.627972 2.69239 0.628613
H  0.408914 2.458491 -1.95277
H  1.903684 1.363728 -1.936773
H  2.764339 -0.896297 -0.888175
H  -1.660081 2.931179 -0.448104
H  -1.418822 -3.39618 0.439622
H  -3.409867 -1.682233 0.640498
H  2.80816 -3.382782 -0.587096
H  -4.081371 2.582924 0.101892
H  0.744256 -4.624442 0.082875
H  -4.946497 0.303064 0.645931
