program: Gaussian 09
title: 000282551
version: EM64L-G09RevD.01
frameworkgroup: C1[X(C9H8Cl2O)]
method: RPBEPBE
basis: SDD
operation: Freq
keyword: #p
keyword: freq=noraman
keyword: PBEPBE/SDD
title: #p freq=noraman PBEPBE/SDD
converged: NO YES NO NO
title: Mulliken charges:
elementType: Cl Cl O C C C C C C C C C H H H H H H H H
charge: 0.032348 0.036951 -0.222084 0.385644 -0.652241 0.185958 0.117318 -0.216231 -0.355429 -0.793484 0.004268 -0.499070 0.276522 0.276530 0.228535 0.262536 0.241869 0.223453 0.241849 0.224760
chargesum: 0.00000
title: Mulliken charges with hydrogens summed into heavy atoms:
elementType: Cl Cl O C C C C C C C C C
charge: 0.032348 0.036951 -0.222084 0.385644 -0.099189 0.185958 0.117318 0.012304 -0.092893 -0.086314 0.229028 -0.499070
polarizability: 2.11693593e+02 1.67746266e+00 1.44815480e+02 -5.15814635e-03 -5.15854485e-03 5.33405115e+01
1716.lowfreq: -50.9685 -5.7676 -0.0026 0.0016 0.0019 6.2406 10.3252 26.5417 74.8860
frequency: -50.9569 26.4067 74.8711 96.0734 110.8637 177.3388 218.7102 219.9086 273.2211 324.3584 366.4385 375.9105 429.7406 448.9626 476.4658 551.6992 559.0798 594.2059 627.5791 710.3605 738.3726 812.5057 814.8804 850.5205 888.7859 929.7797 952.0155 1000.5735 1038.8610 1083.7617 1152.9790 1198.6789 1198.7220 1253.8100 1264.6977 1306.5464 1342.9928 1387.5629 1404.9057 1412.7568 1468.9638 1471.8081 1541.1931 1565.5167 1583.2608 1631.1618 2980.3332 2989.4513 3029.8297 3049.2485 3106.7918 3113.6012 3143.2383 3162.0733
redmass: 1.0643 11.1366 3.8670 3.6227 10.6979 2.6071 8.7761 13.9514 3.8054 7.0987 3.3678 5.0549 7.0832 3.5354 4.5640 6.7373 2.3467 2.9156 6.8140 6.1153 5.1152 7.8616 1.4061 1.3815 3.0544 2.8072 1.7256 1.3168 1.5446 2.4535 1.8568 2.3592 1.1640 1.6899 2.6691 1.3265 2.5665 1.1645 1.2002 2.0185 1.0439 1.1618 4.5618 8.8055 8.6068 6.4569 1.0407 1.0619 1.0950 1.0972 1.0892 1.0944 1.0849 1.0961
irintensity: 0.4933 1.8859 3.6406 1.1665 0.5976 3.2335 2.4720 0.0740 2.2175 2.0482 1.2119 6.5960 7.8637 16.1042 3.3913 13.3810 0.6851 0.0077 35.8573 3.3709 3.7367 144.8016 27.1231 6.0711 13.3539 22.7323 19.1699 1.0660 5.1762 7.6303 5.4589 42.3559 5.6768 0.2809 23.3581 7.3419 1.6950 36.6366 23.0387 3.6993 14.2849 5.6359 125.3508 199.0011 73.3753 30.3488 20.7406 0.9519 0.3898 15.2501 16.1333 21.0179 12.5321 7.2405
temp: 298.150 k
press: 1.00000 atm
elementType: 17 17 8 6 6 6 6 6 6 6 6 6 1 1 1 1 1 1 1 1
symmnumber: 1
zpe: 374026.7 jmol-1
zpe.correction: 0.142459 hartree
zpe.thermalcorrener: 0.153881 hartree
zpe.thermalcorrenthalpy: 0.154825 hartree
zpe.thermalcorrgfe: 0.103229 hartree
zpe.sumelectzpe: -1342.181399 hartree
zpe.sumelectthermal: -1342.169977 hartree
zpe.sumelectthermalent: -1342.169033 hartree
zpe.sumelectthermalfe: -1342.220630 hartree
dipole: -0.0905 4.9570 0.0011
dipole: 4.9579
quadrupole: -89.6845 -85.6970 -84.9761
quadrupole: 13.3903 0.0043 -0.0039
quadrupole: -2.8986 1.0889 1.8098 13.3903 0.0043 -0.0039
hfenergy: -1342.3238585 hartree
pointgroup: C01 [X(C9H8Cl2O1)]
dipole: -0.0887147 -1.9485598 -0.0004244 debye
dipolederiv: -0.9427579 -0.165756 0.0001033 -0.3612151 -0.2582681 0.0001283 0.0001951 0.0001108 0.0081464 -0.2080583 -0.0346699 0.0000214 0.2547251 -0.7261869 0.0003405 -0.0001088 0.0003405 0.0433822 -0.5070391 -0.1778948 -0.0000809 -0.6112926 -1.0074713 -0.000222 -0.0001309 -0.0001243 -0.3535061 0.264063 -0.0067534 0.0000107 -0.1557758 0.0018228 -0.0000406 0.0001078 -0.0000372 0.012522 -0.383984 -0.070022 -0.0001071 0.1077911 -0.070853 0.0000451 -0.0002509 -0.0000705 0.053861 -0.5711342 0.0865666 -0.000047 0.1541138 0.3795779 0.0000421 -0.0000052 0.0001094 -0.0673446 0.2868605 -0.0332513 0.0001167 0.7511795 1.1532542 0.0003255 0.0002691 0.0002473 0.173241 0.7461321 -0.0014203 0.0000289 0.0561866 0.1566 0.0000677 -0.0000917 0.0000548 -0.1049142 0.0370457 0.2136936 0.0000347 -0.4893663 -0.5503917 -0.000101 0. -0.0000705 -0.1613477 0.0123179 0.0084284 -0.0000028 0.0579011 -0.1812172 -0.0000208 0.0001428 -0.0001663 0.0777848 -0.2945722 -0.0798312 0.0000278 0.2169582 -0.3178591 0.0000847 -0.0001104 0.0001418 -0.0575448 1.2862937 0.2334487 -0.0001538 -0.0274456 1.2344007 -0.0006396 -0.000077 -0.0006027 -0.1915652 0.1042723 -0.0160837 -0.0552441 -0.0195171 0.0468869 0.0407956 -0.0492795 0.0416614 0.0400016 0.1042072 -0.0160444 0.0552756 -0.0195085 0.0468599 -0.04082 0.0493725 -0.0416692 0.0400839 0.0069101 0.0834901 0.0000179 0.1381643 -0.0546081 -0.0000207 -0.0000013 0.0000022 0.1278101 -0.0491515 0.0060353 0.0000074 -0.0453128 0.0727948 -0.000017 -0.000029 -0.0000328 0.1674149 0.0938661 0.0382128 0.0912813 0.0444246 0.0057462 -0.0540347 0.0739462 -0.1064937 -0.0296188 -0.1212312 -0.094648 0.0001417 0.0019836 0.0855718 -0.0000115 0.0000681 0.0000597 0.1076897 0.0936439 0.0384033 -0.0914174 0.0444596 0.0057724 0.0540261 -0.0740738 0.1064857 -0.0294068 0.042316 -0.0119039 -0.0000141 -0.0984536 -0.0224321 0.0000723 0.000057 0.0000539 0.1433107 unknown
polarizability: 211.5526221|-3.4959765|144.9564509|0.0050157|-0.0052971|53.3405115 unknown
InChI: InChI=1S/C9H8Cl2O/c1-6-2-3-8(12)4-7(6)5-9(10)11/h2-3,5H,4H2,1H3
charge 0 multiplicity 1
20 atoms
Cl -4.287655 -0.545822 0.00028
Cl -2.64091 1.968654 -0.000851
O  2.40538 2.459756 0.000663
C  -0.09104 -0.391743 0.000092
C  0.423715 1.040507 0.000005
C  0.816201 -1.454259 0.000057
C  1.939819 1.276077 0.000314
C  2.25132 -1.171553 -0.000032
C  2.801222 0.090735 0.000072
C  0.468693 -2.934801 0.000044
C  -1.527133 -0.656429 0.00021
C  -2.616725 0.166867 -0.000075
H  0.015669 1.588647 -0.872186
H  0.015183 1.589026 0.871713
H  2.92151 -2.042397 -0.000148
H  3.884022 0.254685 0.000074
H  0.906312 -3.428979 -0.888466
H  -0.608214 -3.156782 0.000656
H  0.907381 -3.429242 0.887874
H  -1.812954 -1.713745 0.000604
