program: Gaussian 09
title: 000282594
version: EM64L-G09RevD.01
frameworkgroup: C1[X(C18H18ClNO3)]
method: RPBEPBE
basis: SDD
operation: Freq
keyword: #p
keyword: freq=noraman
keyword: PBEPBE/SDD
title: #p freq=noraman PBEPBE/SDD
converged: NO YES NO NO
title: Mulliken charges:
elementType: Cl O O O N C C C C C C C C C C C C C C C C C C H H H H H H H H H H H H H H H H H H
charge: 0.058718 -0.251789 -0.162925 -0.161711 -0.218078 -0.002461 -0.420336 -0.441640 -0.396571 -0.402806 -0.389264 0.483287 0.215352 -0.107444 -0.609515 0.326521 -0.780793 0.280747 0.008238 -0.371349 -0.359737 -0.225077 -0.222341 0.199001 0.249828 0.199865 0.236996 0.244997 0.203447 0.188640 0.190291 0.202401 0.196196 0.201017 0.238907 0.264639 0.255070 0.292913 0.294918 0.245608 0.246240
chargesum: 0.00000
title: Mulliken charges with hydrogens summed into heavy atoms:
elementType: Cl O O O N C C C C C C C C C C C C C C C C C C
charge: 0.058718 -0.251789 -0.162925 -0.161711 -0.218078 0.196540 0.029358 0.040353 -0.004484 -0.010114 0.007949 0.483287 0.215352 -0.107444 -0.609515 0.326521 -0.022177 0.280747 0.008238 -0.078436 -0.064819 0.020531 0.023898
polarizability: 3.22246791e+02 1.21727863e+01 2.33145853e+02 2.73546715e+01 -1.97289865e+01 1.54815707e+02
1716.lowfreq: -7.0880 -0.0011 -0.0010 0.0012 6.1715 17.0026 31.5496 37.4533 59.5928
frequency: 31.3331 36.5475 59.2395 66.0451 80.0173 96.1656 112.9967 121.9089 130.8734 152.4769 170.6208 183.1388 206.0287 228.6986 235.9494 254.7363 287.9241 308.8135 326.6270 336.7744 352.8461 371.2174 400.4493 420.8089 429.0725 451.5527 452.2280 469.9545 472.4679 514.7485 523.8329 569.4640 591.4754 624.8151 685.2703 694.7196 701.2201 729.5600 749.1249 791.2191 796.4765 807.6986 824.1121 841.2524 846.1895 854.0175 898.6221 902.2551 921.0819 930.3429 946.2719 989.0425 997.6454 1009.8878 1015.8897 1032.7512 1041.1690 1045.7806 1058.5061 1063.9113 1072.7108 1083.0318 1113.0265 1121.8353 1149.7512 1174.3797 1192.5529 1212.8851 1235.8035 1247.8750 1252.1063 1258.6145 1269.6495 1284.4101 1291.3924 1303.3535 1324.1694 1332.3030 1337.3027 1343.5838 1346.8195 1379.3092 1399.8337 1402.1771 1439.6499 1449.9873 1462.8973 1464.2861 1466.1064 1471.2894 1472.3547 1473.7176 1483.9696 1536.8624 1550.8394 1553.6375 1594.6400 1599.2818 1606.2522 2961.3575 2963.9796 2973.2796 2991.2423 2996.7613 2998.5479 3015.2855 3028.9728 3032.9634 3041.0206 3070.8585 3085.6671 3091.8150 3124.3532 3141.8046 3155.3345 3165.2242 3175.3251
redmass: 5.4143 5.8750 4.8633 6.8628 4.6385 2.8810 5.3660 3.7343 1.6797 2.5562 4.3219 5.7306 6.0455 3.3705 2.1489 5.5623 8.5824 3.8950 7.2591 2.5703 4.4807 11.2936 4.6281 3.9198 3.4431 2.8811 4.7797 2.9567 5.2706 2.3383 7.4699 4.7300 3.6951 7.1725 4.9479 6.5052 4.4222 2.7300 4.3442 1.4872 3.4829 1.8934 4.1726 3.5378 2.9731 2.9569 2.0574 1.5185 1.8535 1.6397 2.6059 2.1944 1.3974 4.0014 1.3703 1.7265 2.3687 1.8525 1.2334 2.3160 1.3755 2.9950 2.5817 2.8794 2.3957 1.0767 1.5786 2.6620 1.8995 2.7272 1.6124 1.3039 1.9768 2.1593 2.7179 1.2961 1.3961 1.3686 1.5365 1.4656 1.4839 1.2120 1.4887 9.8749 2.4325 1.0765 1.0872 1.0889 1.0583 2.2391 1.1741 1.0865 1.0906 10.0538 10.6613 11.3847 7.9411 8.2422 6.7139 1.0635 1.0641 1.0621 1.0830 1.0634 1.0367 1.0648 1.0960 1.0926 1.1018 1.1011 1.1038 1.0979 1.0998 1.0865 1.0903 1.0949 1.1006
irintensity: 1.1529 1.0793 1.6590 1.9679 0.2706 2.5770 1.6724 0.6287 1.7240 2.4911 1.0583 0.3172 1.8078 1.3816 0.8792 0.8944 1.1902 1.1579 0.8652 1.3560 2.9808 20.0080 16.1374 0.8552 3.1875 1.0614 3.6778 2.5527 7.8107 5.6126 0.8173 8.3780 3.6478 18.6274 3.1395 4.9292 8.7834 65.7196 8.3147 1.9628 36.4017 33.3535 25.7285 8.5940 4.5431 0.9622 6.6189 15.0217 6.2737 1.9676 11.3348 126.6387 2.9591 6.9479 0.0444 12.8648 9.0669 1.1394 3.1173 32.6704 13.5290 0.1733 0.5601 46.8171 36.2421 10.4376 5.6735 78.4913 156.9147 184.8634 62.8939 2.4070 228.0046 25.6954 92.1264 0.5249 12.7788 1.2598 31.1769 1.1608 8.5030 40.3663 46.3228 0.2137 1.9017 22.8283 7.5161 5.2908 21.5686 5.6165 10.9823 15.0902 6.8023 60.2951 350.3151 243.2637 130.9256 16.6683 1.4499 30.4739 40.3200 37.4381 8.6310 20.6902 5.3160 10.3583 60.5757 64.8461 53.8976 17.4692 20.9143 7.2663 8.7638 3.5019 3.7799 0.7890 25.2878
temp: 298.150 k
press: 1.00000 atm
elementType: 17 8 8 8 7 6 6 6 6 6 6 6 6 6 6 6 6 6 6 6 6 6 6 1 1 1 1 1 1 1 1 1 1 1 1 1 1 1 1 1 1
symmnumber: 1
zpe: 843452.9 jmol-1
zpe.correction: 0.321254 hartree
zpe.thermalcorrener: 0.342058 hartree
zpe.thermalcorrenthalpy: 0.343002 hartree
zpe.thermalcorrgfe: 0.271369 hartree
zpe.sumelectzpe: -1435.539594 hartree
zpe.sumelectthermal: -1435.518791 hartree
zpe.sumelectthermalent: -1435.517847 hartree
zpe.sumelectthermalfe: -1435.589479 hartree
dipole: -3.8302 -3.4366 -0.5363
dipole: 5.1738
quadrupole: -131.0741 -144.7030 -143.4683
quadrupole: 9.0441 -8.4141 4.9069
quadrupole: 8.6743 -4.9545 -3.7198 9.0441 -8.4141 4.9069
hfenergy: -1435.8608486 hartree
pointgroup: C01 [X(C18H18Cl1N1O3)]
dipole: 1.5561075 -1.0787461 0.7471773 debye
polarizability: 321.698476|4.1465488|235.1615375|31.6244955|-14.1082528|153.3483373 unknown
InChI: InChI=1S/C18H18ClNO3/c1-11(21)20(12-7-3-2-4-8-12)16-15(19)17(22)13-9-5-6-10-14(13)18(16)23/h5-6,9-10,12H,2-4,7-8H2,1H3
charge 0 multiplicity 1
41 atoms
Cl -0.147988 3.15141 -0.529776
O  -3.095434 0.723698 -2.215363
O  0.227176 -2.02954 -0.350831
O  2.745349 2.835292 0.054501
N  -1.321291 0.257659 -0.773045
C  -2.234911 -0.309781 0.296297
C  -3.123283 0.807739 0.905361
C  -3.066046 -1.520685 -0.185783
C  -3.9777 0.234919 2.063593
C  -3.915908 -2.074839 0.985273
C  -4.818134 -0.978017 1.599196
C  0.053721 0.373863 -0.448366
C  -1.847732 0.678531 -2.01817
C  0.81213 -0.913381 -0.203823
C  0.721049 1.580895 -0.339507
C  2.251737 -0.826057 0.175175
C  -0.856358 1.005895 -3.129123
C  2.910198 0.431588 0.248365
C  2.173695 1.705683 -0.017805
C  2.971912 -2.015059 0.444905
C  4.282831 0.491155 0.587704
C  4.338919 -1.95077 0.78532
C  4.994997 -0.696367 0.856357
H  -1.553732 -0.669974 1.093475
H  -3.779971 1.210507 0.113973
H  -2.485817 1.637297 1.267196
H  -2.380118 -2.296123 -0.570191
H  -3.732047 -1.206865 -1.007959
H  -4.635423 1.031089 2.462309
H  -3.314314 -0.078808 2.897222
H  -3.247862 -2.482823 1.772956
H  -4.531703 -2.919835 0.622165
H  -5.396412 -1.389068 2.449293
H  -5.552183 -0.642091 0.83886
H  0.039947 0.363553 -3.106776
H  -1.380595 0.870959 -4.087519
H  -0.533361 2.060455 -3.065263
H  2.444144 -2.971418 0.377157
H  4.764916 1.472298 0.636719
H  4.894793 -2.870926 0.992688
H  6.056511 -0.648657 1.120434
