program: Gaussian 09
title: 000028191
version: EM64L-G09RevD.01
frameworkgroup: C1[X(C18H24F2O)]
method: RPBEPBE
basis: SDD
operation: Freq
keyword: #p
keyword: freq=noraman
keyword: PBEPBE/SDD
title: #p freq=noraman PBEPBE/SDD
converged: NO YES NO NO
title: Mulliken charges:
elementType: F F O C C C C C C C C C C C C C C C C C C H H H H H H H H H H H H H H H H H H H H H H H H
charge: -0.192472 -0.207690 -0.233200 -0.208969 0.259816 -0.086917 -0.076564 -0.507648 -0.500538 -0.515479 0.272159 -0.233152 -0.480873 -0.525134 -0.771561 -0.636426 0.534944 -0.466898 -0.541318 -0.574575 0.178158 0.239660 0.222904 0.220064 0.230804 0.218359 0.227313 0.204569 0.235938 0.229084 0.230468 0.231496 0.217475 0.247277 0.250577 0.212678 0.234520 0.238212 0.237498 0.220186 0.221508 0.214112 0.226403 0.244975 0.258255
chargesum: 0.00000
title: Mulliken charges with hydrogens summed into heavy atoms:
elementType: F F O C C C C C C C C C C C C C C C C C C
charge: -0.192472 -0.207690 -0.233200 0.030691 0.259816 0.135987 0.143500 -0.058485 -0.068655 -0.050457 0.272159 -0.002683 -0.031901 -0.027279 -0.086150 -0.178742 0.534944 -0.031278 -0.069941 -0.316320 0.178158
polarizability: 2.44648658e+02 3.81783908e+00 1.71465236e+02 1.20316227e+01 1.26960629e-01 1.46836470e+02
1716.lowfreq: -19.2812 -12.1442 -0.0006 -0.0005 0.0005 4.7395 30.7332 50.1789 69.0378
frequency: 30.5148 50.1734 69.0243 88.7511 121.7316 149.9401 154.9370 163.1596 175.1245 200.3620 212.9660 230.2165 258.7970 267.1417 300.7357 319.0641 338.2058 355.2393 370.9433 383.7406 406.0637 417.9424 452.6575 464.1849 469.4313 485.2389 512.6570 533.0020 545.5109 583.5911 588.7501 619.6428 642.2291 685.4287 713.1885 756.2465 776.0089 799.2687 815.4704 820.3127 845.4005 860.0888 867.7977 898.6701 913.2294 923.4539 949.8743 966.4599 971.9144 996.7021 1004.4791 1014.2435 1020.7569 1026.2899 1035.1199 1058.0569 1063.7013 1075.9215 1086.7756 1096.9556 1111.6437 1126.9897 1133.2789 1140.8618 1154.5625 1161.8911 1174.4783 1186.1726 1203.5819 1208.2618 1217.3057 1228.1789 1235.0329 1255.6712 1261.5413 1267.8250 1273.1877 1284.8071 1289.4833 1294.0968 1299.2230 1303.6325 1315.0980 1321.5385 1328.8512 1337.4918 1340.6131 1345.6923 1350.9267 1354.1328 1356.6023 1367.6261 1392.6017 1443.4368 1453.7931 1460.2554 1460.7838 1466.6908 1468.6444 1469.9462 1476.5664 1482.5481 1486.3658 1588.8382 1628.9914 2900.6649 2923.4348 2944.6862 2946.3369 2971.2206 2971.8117 2973.5848 2976.1666 2978.9874 2985.0198 2990.8294 3013.5124 3034.0044 3037.9525 3039.9969 3043.2934 3049.0433 3050.9793 3066.9345 3071.4342 3081.0594 3095.0740 3104.3019 3122.6337
redmass: 6.6409 3.6939 6.4087 3.0667 3.5431 2.5246 1.3570 3.0629 2.2821 4.5245 2.8107 3.3407 2.4726 3.2102 2.5961 4.0855 2.7550 4.1018 3.0156 3.8717 3.3904 3.2262 3.4363 4.0529 3.5663 3.2324 3.1462 2.5827 3.1755 3.4495 5.4122 4.0559 3.5229 2.5864 3.1540 2.2520 1.7013 2.3879 2.4160 2.1320 2.0012 2.3410 2.3132 1.4101 1.9273 2.2249 1.6414 2.3351 2.1861 2.0762 2.2793 2.3849 2.3954 2.1317 2.2115 2.0251 2.6707 2.2749 1.8889 2.3399 2.5066 1.5034 2.0523 1.8715 2.1599 1.7520 2.0066 1.6984 1.6252 1.3766 1.5400 1.4905 1.4609 1.8067 1.4435 1.6482 1.5489 1.3578 1.3625 1.4314 1.3201 1.5098 1.4725 1.4792 1.5127 1.4393 1.4867 1.4974 2.3277 1.5252 1.4736 1.4550 1.2065 1.0822 1.0892 1.0754 1.0762 1.0879 1.0883 1.0769 1.0637 1.0689 1.0819 9.9657 7.7612 1.0792 1.0802 1.0743 1.0751 1.0696 1.0737 1.0726 1.0600 1.0615 1.0619 1.0374 1.0615 1.0987 1.0966 1.0626 1.0967 1.0989 1.0981 1.0952 1.1027 1.0991 1.0994 1.1037 1.0914
irintensity: 4.4264 1.7833 2.2014 0.0849 0.7844 0.9133 0.3750 0.5604 2.1394 0.1332 0.9278 0.6025 0.2864 2.6322 3.8974 0.6703 2.8639 6.9516 0.7731 0.8635 2.3650 0.6480 6.7962 0.5668 4.7499 2.1026 1.1772 0.3053 2.3449 3.8484 3.1247 0.4868 2.7089 2.9014 7.2358 8.1093 7.2041 1.7073 0.4939 4.9833 23.1178 18.7851 4.2940 21.5112 11.6184 32.5434 5.9241 2.0037 19.3631 9.0633 4.9072 26.8189 1.4478 36.3138 12.2943 18.1787 9.7949 25.9499 2.7290 18.9358 13.1067 8.8788 5.9017 7.5819 18.8648 8.3284 6.6490 13.6687 2.6566 25.3738 24.6451 4.6599 1.9108 11.8470 7.6130 47.0322 8.0917 5.1813 1.7805 6.7689 0.4224 18.3807 4.7709 7.2115 5.4214 0.3279 6.4886 2.6039 10.5652 3.2089 0.7119 3.2846 18.1829 14.2169 15.3685 1.1960 11.1172 16.4170 7.2722 3.5124 2.9146 14.8147 20.7706 166.6121 188.2348 8.1672 6.2003 2.8807 39.1592 31.0492 5.3538 22.8219 41.8424 47.8167 22.5237 24.2267 24.6566 35.4319 34.6549 16.2107 34.1604 68.4006 18.9958 20.2784 14.7433 28.9015 16.9881 19.1702 9.7402
temp: 298.150 k
press: 1.00000 atm
elementType: 9 9 8 6 6 6 6 6 6 6 6 6 6 6 6 6 6 6 6 6 6 1 1 1 1 1 1 1 1 1 1 1 1 1 1 1 1 1 1 1 1 1 1 1 1
symmnumber: 1
zpe: 1004182.4 jmol-1
zpe.correction: 0.382473 hartree
zpe.thermalcorrener: 0.401313 hartree
zpe.thermalcorrenthalpy: 0.402257 hartree
zpe.thermalcorrgfe: 0.336341 hartree
zpe.sumelectzpe: -973.641896 hartree
zpe.sumelectthermal: -973.623056 hartree
zpe.sumelectthermalent: -973.622112 hartree
zpe.sumelectthermalfe: -973.688028 hartree
dipole: 1.8111 0.5909 1.1809
dipole: 2.2414
quadrupole: -187.0963 -119.0187 -121.4659
quadrupole: 4.6192 -11.7957 -1.4164
quadrupole: -44.5693 23.5082 21.0611 4.6192 -11.7957 -1.4164
hfenergy: -974.0243688 hartree
pointgroup: C01 [X(C18H24F2O1)]
dipole: 0.7153662 -0.2343912 -0.4592495 debye
polarizability: 244.7855857|-3.7706609|171.4522748|-11.490695|-0.0829699|146.7125036 unknown
InChI: InChI=1S/C18H24F2O/c1-17-8-6-14-13-5-3-12(21)10-11(13)2-4-15(14)16(17)7-9-18(17,19)20/h10,13-16H,2-9H2,1H3
charge 0 multiplicity 1
45 atoms
F  4.604756 1.371209 0.68455
F  4.806796 -0.658853 -0.337263
O  -5.962809 0.124522 0.795405
C  1.808886 -0.903519 -0.17322
C  2.60488 0.417864 -0.450827
C  0.318775 -0.83397 -0.597769
C  -0.421665 0.401347 -0.015163
C  1.82823 1.63466 0.140872
C  0.362572 1.697148 -0.342875
C  2.069797 -1.218146 1.339778
C  3.866525 0.1647 0.405331
C  -1.905823 0.484674 -0.517702
C  -0.433293 -2.136821 -0.247909
C  3.453722 -0.580759 1.681768
C  2.945272 0.645152 -1.937903
C  -1.879667 -2.096275 -0.795421
C  -2.634426 -0.85196 -0.36532
C  -2.670372 1.636232 0.188669
C  -4.192576 1.591441 -0.057584
C  -3.927036 -0.937391 0.086503
C  -4.784636 0.239267 0.338373
H  2.284074 -1.708663 -0.771782
H  0.300924 -0.731907 -1.707033
H  -0.462929 0.290718 1.091438
H  2.359145 2.566185 -0.128069
H  1.8300 1.585963 1.247989
H  -0.121269 2.570063 0.132468
H  0.324972 1.875498 -1.437385
H  2.067625 -2.304942 1.525771
H  1.279433 -0.779983 1.974812
H  -1.860086 0.706361 -1.610871
H  -0.458473 -2.272829 0.851173
H  0.099754 -3.01059 -0.67155
H  3.391205 0.130252 2.52232
H  4.219996 -1.331253 1.934273
H  2.033685 0.8466 -2.526748
H  3.621687 1.511162 -2.053944
H  3.447999 -0.23609 -2.370676
H  -2.440629 -3.002776 -0.503606
H  -1.825061 -2.09959 -1.906392
H  -2.276358 2.612813 -0.145298
H  -2.479978 1.566896 1.279149
H  -4.406975 1.748922 -1.135556
H  -4.721034 2.387461 0.495513
H  -4.406519 -1.915294 0.224312
