program: Gaussian 09
title: 000282571
version: EM64L-G09RevD.01
frameworkgroup: C1[X(C22H13NO)]
method: RPBEPBE
basis: SDD
operation: Freq
keyword: #p
keyword: freq=noraman
keyword: PBEPBE/SDD
title: #p freq=noraman PBEPBE/SDD
converged: YES YES NO NO
title: Mulliken charges:
elementType: O N C C C C C C C C C C C C C C C C C C C C C C H H H H H H H H H H H H H
charge: -0.182374 0.000197 0.251187 0.232092 0.238889 0.035949 0.232231 -0.240449 -0.398114 0.169673 -0.357817 -0.374374 -0.387666 -0.251914 -0.260998 0.313494 -0.240930 -0.245252 -0.328691 -0.372538 -0.305090 -0.245379 -0.238523 -0.232096 0.230516 0.266819 0.232431 0.289598 0.235014 0.238801 0.233646 0.239066 0.273323 0.250024 0.234016 0.232157 0.233081
chargesum: 0.00000
title: Mulliken charges with hydrogens summed into heavy atoms:
elementType: O N C C C C C C C C C C C C C C C C C C C C C C
charge: -0.182374 0.000197 0.251187 0.232092 0.238889 0.035949 0.232231 -0.240449 -0.167598 0.169673 -0.090998 -0.141942 -0.098068 -0.016900 -0.022196 0.313494 -0.007284 -0.006186 -0.055368 -0.122514 -0.305090 -0.011363 -0.006366 0.000986
polarizability: 3.96926850e+02 1.15417089e+01 2.91915414e+02 2.72858333e+00 3.97996806e+00 1.48832168e+02
1716.lowfreq: -2.5368 -0.0007 -0.0006 -0.0005 4.6149 6.9548 25.3014 44.1960 50.6904
frequency: 25.2395 44.1843 50.6771 78.2928 86.2187 98.1800 133.4066 149.3923 163.5908 185.7415 223.2759 231.7541 287.1581 311.1712 330.3558 365.0108 386.1687 397.7081 411.9696 427.3146 434.2461 449.6177 462.2831 491.8677 534.9400 560.8046 565.4488 611.7057 614.4756 626.4268 652.6438 662.6521 672.7946 695.2791 708.1758 737.0336 749.3635 768.8851 772.8256 790.7193 807.0475 823.6613 844.2645 873.7462 882.2965 896.9756 926.6625 958.2757 973.8612 974.2398 988.5555 991.4720 995.5535 997.1147 1001.3244 1013.2016 1031.8113 1040.2913 1055.3494 1068.3660 1091.3983 1096.2063 1132.4366 1175.7694 1176.2490 1185.0141 1200.6562 1224.4552 1242.1008 1256.7990 1278.1126 1298.2075 1314.5487 1330.7412 1373.6770 1380.4610 1385.7599 1430.5639 1434.5860 1436.8612 1468.7203 1478.2659 1490.8877 1499.8638 1554.8388 1563.7919 1577.7495 1588.8084 1604.5873 1605.4028 1613.9152 2143.8359 3129.6613 3133.1077 3136.3966 3138.3430 3146.8921 3150.2639 3151.6410 3158.1548 3161.9802 3166.0259 3171.2947 3173.7554 3200.0287
redmass: 6.5066 5.7295 6.2983 4.2624 6.3614 4.5206 5.3904 6.3005 7.0964 5.8383 4.9980 5.1165 5.1317 6.8945 7.2512 6.5653 6.3968 4.4906 3.2913 5.6026 4.5252 3.8263 7.7287 4.6972 4.0363 6.8448 3.3040 6.5222 6.9272 6.2800 6.7131 6.6390 6.2838 1.8320 2.7345 3.3776 3.1932 1.6054 2.0494 1.7750 3.7852 4.0636 1.2394 6.5329 1.4301 1.7759 1.3984 1.4062 1.3932 1.3908 6.0669 1.3628 6.8659 1.3445 1.3564 5.1451 4.1607 2.2772 2.0783 2.4468 1.7357 2.3488 1.5865 1.0577 1.0666 1.0769 1.1239 2.8749 1.7377 4.0252 2.0626 2.4659 1.9045 1.4438 7.4255 7.3328 6.9928 2.3465 2.5549 2.3545 2.5150 2.2979 4.1013 4.7222 9.7646 5.8129 5.6923 7.5665 5.9091 5.9152 6.8345 12.6565 1.0853 1.0857 1.0855 1.0893 1.0897 1.0892 1.0943 1.0948 1.0936 1.1000 1.1003 1.1002 1.0952
irintensity: 2.6749 0.1455 1.8327 0.5341 1.1198 2.0465 0.7299 2.5189 1.0497 0.8111 0.9482 0.4810 0.0616 4.1035 1.9890 5.0304 0.6636 1.3140 0.5655 2.0268 5.3737 1.2145 7.1117 7.4650 6.0747 0.3157 2.4736 2.6144 2.5279 14.5880 8.3447 4.4839 0.0443 48.6658 6.7013 18.1611 38.7654 103.5563 35.1569 8.0799 2.0236 4.9689 4.5467 3.8645 0.9284 0.1008 1.5143 1.1966 2.2102 2.3522 4.9902 0.0822 1.1987 0.1637 0.4512 2.5286 30.3982 5.2238 3.6919 7.5975 7.4270 10.2129 9.3952 0.0624 1.2128 0.1051 13.6374 64.8496 1.5911 43.5869 66.0440 3.2721 16.0288 3.5979 6.2150 1.2171 10.9724 10.5247 2.3361 34.3545 28.0239 8.9513 20.4555 68.8978 88.1902 6.8761 3.4496 30.0228 5.0830 43.7726 16.6714 17.2490 0.0867 3.4655 1.0297 3.2928 14.1607 1.0518 22.3427 0.3783 26.5194 40.7202 36.0461 21.9554 3.5513
temp: 298.150 k
press: 1.00000 atm
elementType: 8 7 6 6 6 6 6 6 6 6 6 6 6 6 6 6 6 6 6 6 6 6 6 6 1 1 1 1 1 1 1 1 1 1 1 1 1
symmnumber: 1
zpe: 728202.1 jmol-1
zpe.correction: 0.277358 hartree
zpe.thermalcorrener: 0.295704 hartree
zpe.thermalcorrenthalpy: 0.296648 hartree
zpe.thermalcorrgfe: 0.230086 hartree
zpe.sumelectzpe: -974.520288 hartree
zpe.sumelectthermal: -974.501942 hartree
zpe.sumelectthermalent: -974.500998 hartree
zpe.sumelectthermalfe: -974.567560 hartree
dipole: 2.3432 -1.7265 -0.3520
dipole: 2.9318
quadrupole: -109.0897 -136.1326 -140.2118
quadrupole: 6.5158 3.6517 -11.2811
quadrupole: 19.3883 -7.6546 -11.7338 6.5158 3.6517 -11.2811
hfenergy: -974.7976458 hartree
pointgroup: C01 [X(C22H13N1O1)]
dipole: 0.8942659 0.6864123 0.2440718 debye
polarizability: 397.4695745|-8.8080485|288.8662457|4.6697177|18.7298967|151.3386115 unknown
InChI: InChI=1S/C22H13NO/c23-14-20(15-8-2-1-3-9-15)21-18-12-6-4-10-16(18)17-11-5-7-13-19(17)22(21)24/h1-13H
charge 0 multiplicity 1
37 atoms
O  -0.836058 1.673658 1.397971
N  -1.35306 -2.919958 -1.886319
C  2.440915 -0.529202 0.096332
C  1.171599 -1.18127 0.250057
C  2.493827 0.947754 0.005359
C  -0.076075 -0.383341 0.287945
C  1.341709 1.706336 0.377496
C  0.064743 1.035425 0.769509
C  3.617984 -1.321967 0.069714
C  -1.283744 -0.833848 -0.265139
C  1.135481 -2.593276 0.416467
C  3.663229 1.656023 -0.383384
C  1.381485 3.124402 0.389233
C  3.561826 -2.723095 0.200411
C  2.313431 -3.36219 0.385898
C  -2.631149 -0.199267 -0.174789
C  3.690007 3.064383 -0.391913
C  2.548273 3.807212 0.001825
C  -3.168874 0.254953 1.062472
C  -3.444012 -0.123511 -1.344285
C  -1.273144 -1.995806 -1.128049
C  -4.472508 0.791779 1.118207
C  -4.735608 0.433274 -1.287387
C  -5.255857 0.893956 -0.053411
H  4.595494 -0.840651 -0.030292
H  0.17937 -3.089681 0.605396
H  4.55831 1.108837 -0.694337
H  0.47972 3.661559 0.699292
H  4.485243 -3.311492 0.180682
H  2.260148 -4.447362 0.519795
H  4.600161 3.586828 -0.706476
H  2.572389 4.901777 -0.00572
H  -2.573839 0.169996 1.972586
H  -3.05429 -0.492798 -2.299642
H  -4.873576 1.131008 2.079067
H  -5.338925 0.501029 -2.198914
H  -6.265519 1.317028 -0.00626
