program: Gaussian 09
title: 000282552
version: EM64L-G09RevD.01
frameworkgroup: C1[X(C17H14O2)]
method: RPBEPBE
basis: SDD
operation: Freq
keyword: #pfreq=noraman
keyword: PBEPBE/SDD
title: #p freq=noraman PBEPBE/SDD
converged: YES YES NO NO
title: Mulliken charges:
elementType: O O C C C C C C C C C C C C C C C C C H H H H H H H H H H H H H H
charge: -0.279897 -0.273820 0.161470 0.144941 -0.000219 0.115633 0.430424 -0.398639 -0.415438 -0.348919 -0.364271 -0.489307 -0.232523 -0.226731 -0.255406 -0.264655 0.232379 -0.261351 -0.665252 0.248622 0.248362 0.244151 0.329561 0.252086 0.230396 0.228714 0.230516 0.231425 0.232808 0.222528 0.215605 0.226966 0.249843
chargesum: 0.00000
title: Mulliken charges with hydrogens summed into heavy atoms:
elementType: O O C C C C C C C C C C C C C C C C C
charge: -0.279897 -0.273820 0.161470 0.144941 -0.000219 0.115633 0.430424 -0.150018 -0.167075 -0.104768 -0.034711 -0.237221 -0.002127 0.001982 -0.024890 -0.033230 0.232379 0.193985 0.027162
polarizability: 3.03505468e+02 -1.93071480e+00 2.56405282e+02 8.18956515e+00 1.25773876e+00 8.42684454e+01
1716.lowfreq: -8.1881 -2.6729 0.0001 0.0005 0.0008 7.0050 31.6559 39.9745 76.7255
frequency: 31.5904 39.9081 76.7185 85.0282 108.0160 114.5988 140.1881 190.8211 202.1730 218.9455 239.1568 279.9825 287.1563 331.8368 404.8944 414.3194 431.4066 433.6318 459.9588 509.8310 562.2901 563.9589 616.0272 625.7040 648.6364 680.8625 683.2299 722.6735 745.3532 759.4721 770.3516 792.7297 793.7178 799.2682 819.2575 881.9994 896.0835 897.0016 908.0780 953.0234 959.0153 975.3198 987.5507 994.7086 1017.3065 1018.1423 1026.6641 1038.3216 1072.7691 1093.4691 1109.4176 1113.6759 1151.3137 1155.7228 1171.3708 1181.7194 1212.4628 1244.5672 1279.0862 1296.3734 1303.5575 1348.4192 1361.7872 1384.0664 1388.5049 1407.7430 1439.8523 1446.4804 1454.1454 1462.3786 1464.5892 1482.1300 1484.2603 1580.5543 1594.1949 1600.6716 1612.5624 1616.6352 1643.8890 2993.0586 3027.0836 3088.1139 3092.0593 3117.9553 3126.2113 3126.9950 3134.2378 3140.1418 3140.9667 3147.1709 3158.6833 3165.1810 3176.7848
redmass: 3.9697 3.3233 6.0591 4.2280 3.2358 5.0819 3.8600 3.0993 2.3547 4.0894 2.0479 4.8492 4.6174 3.5076 3.4168 5.3065 3.4866 3.5382 3.6201 5.3256 6.9967 3.2708 6.7780 5.9627 4.0292 3.8203 4.7024 5.3770 1.6960 1.6457 5.3524 1.8877 1.9533 2.7973 1.9640 1.4010 3.8121 1.5069 1.6114 1.4340 5.0596 1.3845 1.3420 6.7518 1.3338 3.2507 2.3148 1.9447 3.5223 2.1779 1.8125 2.8126 1.6839 1.6802 1.1157 1.1793 2.3738 2.2455 1.1146 1.5825 1.6899 1.3284 2.3414 2.5899 1.2585 3.0060 2.2463 2.7989 1.1066 1.0438 2.6145 3.9919 1.0702 6.7763 6.7137 7.9676 6.7363 7.3410 8.5669 1.0361 1.0591 1.0975 1.1035 1.1053 1.0857 1.0857 1.0895 1.0891 1.0908 1.0944 1.0975 1.1003 1.0967
irintensity: 1.0224 0.7185 0.5614 2.3032 0.5141 0.4609 0.0403 0.6926 3.1603 3.7190 1.0568 1.7779 1.9261 21.3430 3.1577 2.6021 2.8803 5.2601 0.5318 0.0137 2.3983 0.0062 1.4080 4.0015 3.6620 5.3927 8.6512 0.7663 103.1722 1.7717 2.5533 16.6162 41.7799 25.5761 0.6685 1.4134 19.5812 5.9445 18.1950 2.6057 26.8027 3.9827 0.0859 2.9136 2.9275 94.1375 16.0546 7.8533 148.4952 85.0417 14.5415 430.7462 13.5020 8.9929 5.2651 0.0809 32.8657 5.8814 5.6269 17.0383 14.2640 14.3528 15.7046 37.2778 18.4931 5.3949 50.6528 28.0119 20.7437 12.3893 1.1421 31.7242 17.4872 10.8875 1.0949 156.3311 28.9667 89.9049 116.7977 27.2523 42.7444 42.0898 1.2797 36.6519 3.5053 0.5212 4.7752 0.8905 14.4420 23.4225 29.3797 35.9700 29.9506
temp: 298.150 k
press: 1.00000 atm
elementType: 8 8 6 6 6 6 6 6 6 6 6 6 6 6 6 6 6 6 6 1 1 1 1 1 1 1 1 1 1 1 1 1 1
symmnumber: 1
zpe: 681452.3 jmol-1
zpe.correction: 0.259551 hartree
zpe.thermalcorrener: 0.275432 hartree
zpe.thermalcorrenthalpy: 0.276377 hartree
zpe.thermalcorrgfe: 0.215215 hartree
zpe.sumelectzpe: -805.355540 hartree
zpe.sumelectthermal: -805.339659 hartree
zpe.sumelectthermalent: -805.338715 hartree
zpe.sumelectthermalfe: -805.399877 hartree
dipole: 0.4771 -1.0777 0.2414
dipole: 1.2031
quadrupole: -86.3425 -98.9260 -116.0020
quadrupole: 3.1645 0.8580 0.4017
quadrupole: 14.0810 1.4975 -15.5785 3.1645 0.8580 0.4017
hfenergy: -805.6150913 hartree
pointgroup: C01 [X(C17H14O2)]
dipole: -0.3024155 -0.3380114 -0.1353584 debye
polarizability: 301.1170219|-10.5128757|255.6139818|-4.5886042|24.3398768|87.4481916 unknown
InChI: InChI=1S/C17H14O2/c1-2-19-17(18)11-16-14-9-5-3-7-12(14)13-8-4-6-10-15(13)16/h3-11H,2H2,1H3
charge 0 multiplicity 1
33 atoms
O  3.205996 -1.978267 -0.251152
O  3.093965 0.337797 0.034003
C  -2.325464 0.385843 -0.010949
C  -1.52748 1.617372 0.158634
C  -1.419291 -0.711619 -0.141934
C  -0.131934 1.271547 0.131043
C  -0.015639 -0.202776 -0.058925
C  -3.716699 0.179744 -0.055873
C  -1.941222 2.949925 0.325577
C  -1.907601 -2.020744 -0.318085
C  0.844427 2.281755 0.275112
C  1.060892 -1.057649 -0.15995
C  -4.203697 -1.139244 -0.233683
C  -0.954096 3.957693 0.46811
C  -3.308051 -2.229516 -0.363447
C  0.420755 3.624033 0.443207
C  2.499907 -0.764683 -0.111081
C  4.694327 -1.880045 -0.249196
C  5.22197 -1.59502 -1.659097
H  -4.416304 1.016575 0.043619
H  -3.004704 3.211857 0.346153
H  -1.228129 -2.874161 -0.419436
H  1.905182 2.022822 0.25543
H  0.853457 -2.124154 -0.300359
H  -5.283657 -1.320007 -0.27113
H  -1.258255 5.002328 0.598987
H  -3.702788 -3.242073 -0.499639
H  1.171936 4.413385 0.555247
H  4.995389 -1.086355 0.457107
H  5.019564 -2.865482 0.121866
H  6.327878 -1.608818 -1.652958
H  4.870873 -2.359565 -2.373315
H  4.892093 -0.601997 -2.007192
