program: Gaussian 09
title: 000282542
version: EM64L-G09RevD.01
frameworkgroup: C1[X(C9H5ClN2O2)]
method: RPBEPBE
basis: SDD
operation: Freq
keyword: #p
keyword: freq=noraman
keyword: PBEPBE/SDD
title: #p freq=noraman PBEPBE/SDD
converged: NO YES NO YES
title: Mulliken charges:
elementType: Cl O O N N C C C C C C C C C H H H H H
charge: -0.027101 -0.384705 -0.232587 0.050474 0.005154 0.090021 0.069783 -0.304796 -0.289402 0.049107 -0.099526 -0.191535 -0.373181 0.130166 0.294846 0.271740 0.266836 0.286281 0.388426
chargesum: 0.00000
title: Mulliken charges with hydrogens summed into heavy atoms:
elementType: Cl O O N N C C C C C C C C C
charge: -0.027101 0.003721 -0.232587 0.050474 0.005154 0.090021 0.069783 -0.009950 -0.017661 0.049107 -0.099526 0.075301 -0.086900 0.130166
polarizability: 2.31277363e+02 -5.42009466e+00 1.26231660e+02 5.41318533e-03 7.91400896e-03 4.70829602e+01
1716.lowfreq: -8.9193 -0.0028 -0.0023 -0.0022 5.7408 6.0559 44.3147 78.1650 101.4660
frequency: 44.2095 78.1620 101.4642 125.7801 226.9755 243.1069 263.0537 303.7142 362.7530 383.1612 418.7287 480.4027 513.9567 517.8907 566.4505 598.8853 604.3211 621.9622 650.3217 689.8170 743.8941 750.1765 792.9803 846.0046 896.7714 897.7188 946.6850 948.0624 976.7134 1027.7696 1050.8240 1118.8250 1167.9918 1199.2065 1235.5697 1245.9105 1310.3575 1344.5793 1372.1893 1398.0018 1436.8916 1470.8275 1514.1184 1537.9678 1600.8256 1620.9028 3161.9201 3165.7679 3180.4815 3183.0046 3513.1956
redmass: 12.1014 6.2084 6.8472 10.4537 9.6274 6.3288 5.2220 12.4680 11.2202 6.2276 4.4599 3.5939 5.8918 4.3882 6.4481 10.5741 1.8052 7.5583 2.1431 5.8775 5.4090 5.8556 2.2057 2.0464 6.3432 1.5399 1.4663 6.6268 1.3424 3.5876 2.1372 1.6666 1.9433 2.2728 4.2341 1.4758 2.6158 3.1765 2.8288 6.0699 4.8263 3.5088 8.4603 8.0225 7.3632 9.0049 1.0885 1.0933 1.0962 1.0958 1.0640
irintensity: 1.7813 0.6973 0.0022 1.1368 1.1242 0.3680 2.4924 2.4177 9.2432 0.1237 5.6643 9.6259 19.2253 26.9885 33.8679 7.0801 49.2361 21.1807 94.0069 27.4446 12.1942 4.7016 5.7550 43.0447 58.5220 14.5737 18.8527 34.3925 2.9836 281.0958 29.7925 15.7244 46.5028 3.1720 20.0165 1.5550 24.3432 73.6093 0.5646 12.9371 34.4515 80.8381 4.0265 22.9034 0.5433 281.7719 0.1224 0.1621 0.5084 4.2978 49.6007
temp: 298.150 k
press: 1.00000 atm
elementType: 17 8 8 7 7 6 6 6 6 6 6 6 6 6 1 1 1 1 1
symmnumber: 1
zpe: 325690.8 jmol-1
zpe.correction: 0.124049 hartree
zpe.thermalcorrener: 0.135140 hartree
zpe.thermalcorrenthalpy: 0.136085 hartree
zpe.thermalcorrgfe: 0.085772 hartree
zpe.sumelectzpe: -1064.998089 hartree
zpe.sumelectthermal: -1064.986998 hartree
zpe.sumelectthermalent: -1064.986053 hartree
zpe.sumelectthermalfe: -1065.036366 hartree
dipole: 1.0603 0.0221 0.0003
dipole: 1.0605
quadrupole: -86.3638 -84.5979 -87.1855
quadrupole: 12.5218 -0.0005 -0.0017
quadrupole: -0.3148 1.4512 -1.1364 12.5218 -0.0005 -0.0017
hfenergy: -1065.1221381 hartree
pointgroup: C01 [X(C9H5Cl1N2O2)]
dipole: -0.4166288 -0.0225346 -0.0001337 debye
dipolederiv: -0.7120992 -0.3050423 -0.0000031 -0.4563757 -0.3298476 0.0000124 0.0000154 0.0000247 -0.0495729 -0.3942833 0.2204385 0.000016 0.4889223 -1.1934798 -0.0000649 0.0002413 -0.0006193 -0.3925941 -1.1034945 -0.233344 -0.0002983 0.0352088 -0.6872004 -0.0002562 0.0003265 0.0001828 -0.3168341 0.1120373 -0.131891 0.0000239 0.0319444 -0.2082614 -0.0000424 -0.0002053 0.0000592 -0.2327089 -0.0906597 -0.0091818 0.0000033 0.0909354 -0.1782894 -0.0000057 0.0000573 -0.0000007 -0.2638103 0.0303467 0.0916996 -0.000005 0.6506737 -0.00402 0.0000894 -0.0000364 0.0000077 0.1212346 0.1514298 0.1341381 -0.0000171 -0.4758837 -0.1088445 0.0000078 0.0001302 0.0000225 0.1081408 -0.3689515 -0.1827868 0.0000055 -0.1089465 -0.0445787 -0.0000359 -0.0000035 -0.0000316 -0.1031666 -0.0553686 -0.0331286 0.0000151 -0.0903857 0.1325226 -0.0000513 -0.000013 -0.000026 -0.1336923 -0.4402078 0.1164561 0.0000789 -0.3170387 0.0270345 -0.000009 -0.0001067 0.0000339 0.146146 1.0071697 0.5885973 -0.0000033 0.8066195 0.4834946 -0.0000385 -0.0000483 -0.0000443 -0.0638155 -0.1335111 -0.1979844 0.0000412 -0.2766107 -0.0977108 -0.0000215 0.0000461 -0.0000199 -0.0860809 -0.0562485 0.0480837 0.0000092 0.2834504 0.1431662 0.0000059 -0.0002463 0.0000193 0.0269673 1.7372013 -0.091903 0.0001305 -0.5445586 1.5165665 0.000366 -0.0002565 0.0004023 0.2056264 0.1013543 0.0191264 -0.00001 -0.0196928 0.0291494 0.0000254 0.0000009 0.0000212 0.1720509 0.0736129 -0.0131021 -0.0000066 0.0419677 -0.0215724 0.0000387 -0.0000258 0.0000288 0.1644094 -0.0123519 0.0506706 -0.0000277 0.0286938 0.0900688 0.0000174 -0.0000149 0.0000164 0.1641716 0.0405761 -0.0548961 -0.0000049 -0.0553701 0.0947042 0.0000012 0.000045 -0.0000224 0.1323566 0.113448 -0.0159502 0.0000527 -0.1135536 0.3570981 -0.0000386 0.0000938 -0.0000543 0.4011722 unknown
polarizability: 229.8810082|13.195026|127.6280154|0.00599|-0.0074869|47.0829602 unknown
InChI: InChI=1S/C9H5ClN2O2/c10-5-1-2-6-7(3-5)12-8(4-11-6)9(13)14/h1-4,13H
charge 0 multiplicity 1
19 atoms
Cl -4.397102 -1.677441 0.000104
O  3.267019 -1.937369 -0.000164
O  4.204209 0.189774 0.000093
N  0.74515 -0.889691 0.000466
N  0.392135 1.980317 -0.000088
C  -0.52053 -0.322657 0.000254
C  -0.700531 1.118279 -0.000037
C  -1.660182 -1.185179 0.000303
C  -2.022377 1.657852 -0.000278
C  1.783491 -0.028576 0.000439
C  -2.927723 -0.609807 0.000061
C  -3.128872 0.805426 -0.00023
C  1.60785 1.404387 0.00015
C  3.189402 -0.55159 0.000788
H  -1.50141 -2.266402 0.00052
H  -2.138971 2.74535 -0.000495
H  -4.146904 1.205495 -0.000411
H  2.486524 2.0556 0.000163
H  4.227221 -2.202666 -0.000639
