program: Gaussian 09
title: 000282568
version: EM64L-G09RevD.01
frameworkgroup: C1[X(C17H18N2O2S)]
method: RPBEPBE
basis: SDD
operation: Freq
keyword: #p
keyword: freq=noraman
keyword: PBEPBE/SDD
title: #p freq=noraman PBEPBE/SDD
converged: YES YES NO NO
title: Mulliken charges:
elementType: S O O N N C C C C C C C C C C C C C C C C C H H H H H H H H H H H H H H H H H H
charge: 0.954078 -0.520100 -0.541675 -0.014781 -0.507884 -0.292334 -0.478595 -0.485057 0.073824 0.320031 -0.375093 -0.424252 -0.222858 -0.224654 -0.029270 -0.232988 -0.235481 -0.238066 0.451639 -0.363718 -0.363742 -0.799339 0.252195 0.262783 0.240939 0.238020 0.257038 0.249459 0.274802 0.319162 0.230588 0.236202 0.234835 0.282598 0.282261 0.243171 0.243045 0.229900 0.243647 0.229671
chargesum: 0.00000
title: Mulliken charges with hydrogens summed into heavy atoms:
elementType: S O O N N C C C C C C C C C C C C C C C C C
charge: 0.954078 -0.520100 -0.541675 -0.014781 -0.188722 -0.040139 0.025128 0.010002 0.073824 0.320031 -0.125634 -0.149450 0.007731 0.011548 -0.029270 0.001847 0.047117 0.044195 0.451639 -0.120546 -0.120697 -0.096122
polarizability: 3.12854295e+02 1.83893991e+01 2.32751298e+02 3.47378770e+00 2.02491465e+00 1.84291935e+02
1716.lowfreq: -6.9923 0.0007 0.0016 0.0016 3.9445 6.4720 16.2905 20.8550 23.6587
frequency: 15.8638 17.1790 22.6756 32.7615 41.4866 43.5517 58.1446 78.6585 87.0740 127.4754 135.0408 152.9205 167.8257 202.1896 225.9627 234.0041 278.4279 283.7268 292.6932 325.6078 338.2782 381.0346 391.9522 401.3138 407.8029 418.8732 421.8134 503.0591 514.2035 550.2511 586.0405 609.6369 623.2884 627.9596 655.0770 694.3638 708.1618 710.3828 766.3022 778.1659 786.6255 791.0368 797.0066 815.9262 830.8692 849.8643 862.0239 868.6849 878.4636 932.5612 946.7390 963.9139 980.3320 983.1261 985.7117 988.4249 991.9206 996.4484 1001.1495 1016.0859 1033.9113 1048.9816 1051.9560 1059.0762 1079.0896 1081.3670 1097.7567 1120.3878 1144.0583 1174.6803 1177.8994 1185.7658 1191.1624 1200.7836 1219.0902 1249.0739 1293.1056 1298.8139 1319.2849 1370.9003 1383.9495 1388.0703 1394.8803 1398.4335 1427.0149 1432.5050 1450.0654 1471.4380 1474.5289 1475.8614 1478.6157 1540.5119 1583.0183 1597.3236 1597.7164 1607.1621 2980.3679 3063.0927 3092.8609 3094.4687 3101.8957 3119.8289 3128.0504 3135.5764 3137.2981 3140.0949 3149.0895 3151.2510 3164.3925 3167.2693 3168.6196 3200.8493 3219.5896 3235.0600
redmass: 5.8078 4.8755 3.4897 4.1717 1.5863 1.7697 4.8703 4.2304 4.3250 4.5044 5.8777 4.3081 7.0205 8.0712 7.2948 4.8220 5.1768 4.8595 4.5146 3.7225 4.4078 3.6395 10.1633 2.9235 2.8627 5.6063 6.2373 3.1071 3.3410 3.7478 5.2756 6.2012 6.8582 2.9913 5.0279 3.3201 3.1631 1.8354 1.9717 4.2985 1.4120 2.6499 1.9087 3.7465 1.4579 1.2469 1.2621 3.3031 1.6376 1.4564 10.8000 1.3352 2.2317 1.4211 2.2113 3.9370 1.4173 4.6536 1.3325 2.3271 1.8286 1.5953 1.2548 2.4781 1.2796 1.5690 1.1318 1.2806 2.5188 1.0564 1.3793 1.1405 1.1171 2.4514 2.9816 1.9997 1.2464 1.2594 1.3600 5.9929 6.8615 2.3520 2.8706 1.2196 1.0884 2.2477 1.3120 1.1036 1.1237 2.1156 2.3032 8.4293 5.9909 6.6460 6.4253 5.9570 1.0390 1.0946 1.1001 1.0507 1.0606 1.0882 1.0863 1.0894 1.0896 1.0914 1.0915 1.0959 1.0956 1.1015 1.0961 1.1181 1.1158 1.0737
irintensity: 1.4214 1.2431 0.3247 0.0563 0.5530 0.0418 0.0512 0.0860 0.4713 3.6692 0.8010 0.1983 5.0032 2.0254 15.3175 5.4454 23.9692 6.8851 1.0938 2.1720 10.2312 2.1422 27.4680 1.9664 0.8051 1.0968 129.9201 50.0007 52.4374 21.2489 22.7125 0.3026 0.3158 6.3281 2.9767 82.5748 3.2080 20.4737 108.1251 3.7753 28.1178 18.4856 88.5823 90.6337 30.7169 0.4306 2.7382 15.0949 3.9106 0.7828 74.5931 1.2912 0.8550 1.1232 1.1611 0.9483 2.3982 2.4570 0.5622 31.3308 24.6957 24.7566 19.8757 31.1227 14.5853 4.2460 0.8748 7.9181 0.9094 0.0553 1.0573 13.9198 0.8131 0.0526 6.4165 22.6131 1.9901 2.4725 0.4549 0.1533 0.9096 46.7203 10.7433 15.7062 10.9163 11.9163 6.1158 16.9416 13.1428 26.7488 11.5264 24.2217 1.8771 4.5215 7.6685 4.0993 26.2213 17.7358 14.9718 17.4315 14.0116 5.2098 1.2544 14.4218 9.0424 9.5962 9.9484 28.4272 2.5040 26.6297 6.9088 1.0238 19.5584 19.0331
temp: 298.150 k
press: 1.00000 atm
elementType: 16 8 8 7 7 6 6 6 6 6 6 6 6 6 6 6 6 6 6 6 6 6 1 1 1 1 1 1 1 1 1 1 1 1 1 1 1 1 1 1
symmnumber: 1
zpe: 811822.0 jmol-1
zpe.correction: 0.309207 hartree
zpe.thermalcorrener: 0.331227 hartree
zpe.thermalcorrenthalpy: 0.332172 hartree
zpe.thermalcorrgfe: 0.253509 hartree
zpe.sumelectzpe: -1314.791860 hartree
zpe.sumelectthermal: -1314.769839 hartree
zpe.sumelectthermalent: -1314.768895 hartree
zpe.sumelectthermalfe: -1314.847558 hartree
dipole: -0.1621 3.8206 -3.7967
dipole: 5.3887
quadrupole: -99.9547 -138.0957 -140.5324
quadrupole: 8.9257 -4.7827 5.5054
quadrupole: 26.2395 -11.9014 -14.3381 8.9257 -4.7827 5.5054
hfenergy: -1315.1010669 hartree
pointgroup: C01 [X(C17H18N2O2S1)]
dipole: 0.0680183 1.5580296 1.4362173 debye
polarizability: 312.8311828|-18.3363999|232.5693245|3.922047|-3.8056945|184.4970211 unknown
InChI: InChI=1S/C17H18N2O2S/c1-13-7-11-16(12-8-13)22(20,21)19-18-17(15-9-10-15)14-5-3-2-4-6-14/h2-8,11-12,15,19H,9-10H2,1H3
charge 0 multiplicity 1
40 atoms
S  -1.099787 -1.512748 -0.914963
O  -1.01306 -1.064488 -2.477566
O  -1.033024 -3.074227 -0.457109
N  0.650072 0.526214 -0.324286
N  0.332413 -0.738327 0.121193
C  2.064861 2.456619 -0.582252
C  1.15805 3.097233 -1.657877
C  0.989277 3.509971 -0.201928
C  1.875181 1.020979 -0.214568
C  3.063875 0.249231 0.278075
C  3.824463 0.714582 1.382679
C  3.459815 -0.953034 -0.37268
C  4.944694 -0.014289 1.839869
C  4.583655 -1.676723 0.082288
C  -2.599643 -0.691641 -0.149609
C  5.325579 -1.213552 1.194009
C  -3.128252 0.445523 -0.778994
C  -3.148091 -1.267001 1.007034
C  -4.871434 0.498842 0.967249
C  -4.273937 1.037295 -0.203196
C  -4.29416 -0.656167 1.560182
C  -6.123027 1.125263 1.554127
H  3.106363 2.789129 -0.556278
H  0.399839 2.435329 -2.085386
H  1.625297 3.797935 -2.355805
H  1.335421 4.49925 0.112162
H  0.118884 3.117883 0.331784
H  3.527655 1.640577 1.888397
H  2.920356 -1.294411 -1.265138
H  1.075076 -1.472895 0.162027
H  5.519567 0.352568 2.697462
H  4.883574 -2.594833 -0.434623
H  6.195428 -1.777245 1.548534
H  -2.666133 0.839446 -1.689306
H  -2.70223 -2.164958 1.446289
H  -4.708209 1.928514 -0.670621
H  -4.745684 -1.083005 2.463059
H  -6.158401 2.212739 1.368504
H  -7.031652 0.684743 1.099767
H  -6.187871 0.959677 2.643391
