program: Gaussian 09
title: 000282554
version: EM64L-G09RevD.01
frameworkgroup: C1[X(C14H24N2O2)]
method: RPBEPBE
basis: SDD
operation: Freq
keyword: #p
keyword: freq=noraman
keyword: PBEPBE/SDD
title: #p freq=noraman PBEPBE/SDD
converged: YES YES NO NO
title: Mulliken charges:
elementType: O O N N C C C C C C C C C C C C C C H H H H H H H H H H H H H H H H H H H H H H H H
charge: -0.283146 -0.283146 -0.445187 -0.445187 0.368083 0.368082 -0.502719 -0.502603 -0.502597 -0.502725 -0.400224 -0.400235 -0.400236 -0.400222 0.220752 0.220751 -0.805052 -0.805052 0.183970 0.265053 0.265011 0.183987 0.183991 0.264996 0.265067 0.183966 0.204340 0.207885 0.207861 0.204345 0.204347 0.207857 0.207889 0.204338 0.299581 0.299581 0.265034 0.231655 0.231611 0.265034 0.231643 0.231624
chargesum: 0.00000
title: Mulliken charges with hydrogens summed into heavy atoms:
elementType: O O N N C C C C C C C C C C C C C C
charge: -0.283146 -0.283146 -0.145606 -0.145606 0.368083 0.368082 -0.053697 -0.053606 -0.053611 -0.053692 0.012001 0.011970 0.011967 0.012005 0.220752 0.220751 -0.076751 -0.076751
polarizability: 1.87305164e+02 -1.26054027e-03 1.48406312e+02 1.98404132e-01 6.54562678e-03 1.49965965e+02
1716.lowfreq: -93.0979 -92.5176 -10.7745 -0.0005 0.0003 0.0006 3.4003 20.8461 59.0440
frequency: -93.0960 -92.5176 59.0440 72.0450 73.3990 83.5870 85.8107 144.7917 171.3164 181.2378 227.2922 229.1117 231.8893 267.4697 322.8789 323.6660 350.3820 357.9428 368.8884 378.3441 402.3873 456.8064 475.2479 492.7088 499.8925 507.6362 515.7130 550.5508 559.6081 575.6186 608.0023 615.4565 654.5900 730.0495 765.6262 793.1570 797.2344 837.9295 862.3367 883.1425 894.5667 912.3408 916.6124 918.4072 948.5814 967.7151 986.3006 995.0648 1011.5718 1015.2766 1028.3151 1028.4389 1036.9558 1063.4674 1084.3396 1116.9726 1118.7689 1122.2022 1124.1174 1136.9742 1161.1487 1184.1046 1202.2992 1231.3265 1240.7847 1259.3965 1263.1213 1267.8954 1294.5162 1305.8143 1326.2245 1327.5153 1333.4301 1340.8972 1341.8992 1345.8563 1347.1718 1363.4994 1368.1519 1368.5165 1438.1975 1445.1226 1463.4076 1463.5561 1463.9524 1465.2638 1466.2373 1466.5969 1466.7602 1473.4175 1476.0988 1476.5503 1496.8608 1498.0969 1621.9142 1627.3461 2973.7606 2973.7653 2980.1823 2980.3370 2980.4659 2982.9993 2983.2193 2984.3629 2985.1617 2985.1782 3034.2242 3035.0116 3044.8908 3045.8435 3058.0640 3058.3596 3061.5347 3062.7537 3071.0077 3071.0294 3132.4538 3132.4713 3542.4600 3542.6986
redmass: 1.0341 1.0305 4.7268 5.2408 4.0336 3.2188 4.3493 3.0227 3.1663 2.5956 4.5759 2.4719 8.1593 2.2282 2.9118 2.6914 3.2577 1.6953 2.2476 3.2656 3.5002 2.3911 2.8497 2.8279 1.2664 1.4431 1.7859 2.4029 4.4771 1.8861 3.4063 2.4710 3.1691 2.9115 2.5712 1.7438 1.4301 2.9916 2.6923 2.0659 2.0205 1.6710 3.4080 3.6476 1.9527 1.6909 2.1192 2.0566 2.2843 1.8279 1.6835 1.6820 1.8137 1.8589 1.5090 1.7341 2.2867 4.4174 3.5628 1.5095 1.2463 3.1194 1.5979 1.6761 1.3142 1.2029 1.8832 2.2958 1.2622 1.9763 1.3528 1.6591 1.3647 1.3548 1.3768 1.4635 1.4760 1.4397 1.2382 1.2583 1.3195 1.1591 1.1075 1.0786 1.0771 1.0900 1.1696 1.0509 1.0550 1.0776 1.2701 1.0918 1.3835 1.2588 5.4550 5.2456 1.0672 1.0671 1.0616 1.0591 1.0681 1.0642 1.0641 1.0631 1.0379 1.0380 1.0981 1.0974 1.1002 1.0995 1.0946 1.0966 1.0948 1.0968 1.0984 1.0984 1.0981 1.0981 1.0763 1.0765
irintensity: 0.0000 0.0040 3.6407 0.0000 28.5398 0.0001 8.5029 0.0787 0.0000 0.5108 12.5041 0.0001 0.0000 0.0000 0.0421 1.2386 0.0000 2.7607 0.0000 1.0204 0.0000 0.0000 13.8488 0.0000 0.0000 129.9127 15.1509 46.7733 0.0000 0.0000 7.0728 0.0000 8.3997 0.0000 8.4185 0.0000 11.0664 16.7582 0.0000 0.0000 10.3475 0.0000 34.0502 0.0000 0.0000 2.2823 0.0000 10.7540 0.0433 0.0000 0.0000 12.3558 10.0224 1.1623 0.0000 0.0000 8.2674 0.0580 0.0000 0.0000 10.7285 0.0000 9.4737 0.0000 2.0831 0.0000 0.0000 146.3359 12.1971 0.0000 3.5926 0.0000 6.1571 0.0000 0.0000 4.1643 11.5205 0.0000 102.9085 0.0000 414.8013 0.0000 12.8273 0.0003 2.6803 0.0000 117.7177 40.4236 0.0002 0.0000 0.0001 16.7279 0.0000 296.9107 288.9327 0.0000 1.5408 0.7377 39.3710 0.0020 0.0010 186.8766 77.0658 0.0002 16.5980 0.0847 92.7713 0.0000 0.0000 125.2258 5.3955 0.0006 0.0005 68.4295 0.4225 30.2755 15.9062 1.2812 43.8082 0.0039
temp: 298.150 k
press: 1.00000 atm
elementType: 8 8 7 7 6 6 6 6 6 6 6 6 6 6 6 6 6 6 1 1 1 1 1 1 1 1 1 1 1 1 1 1 1 1 1 1 1 1 1 1 1 1
symmnumber: 1
zpe: 958956.2 jmol-1
zpe.correction: 0.365247 hartree
zpe.thermalcorrener: 0.382277 hartree
zpe.thermalcorrenthalpy: 0.383221 hartree
zpe.thermalcorrgfe: 0.321830 hartree
zpe.sumelectzpe: -806.460483 hartree
zpe.sumelectthermal: -806.443454 hartree
zpe.sumelectthermalent: -806.442509 hartree
zpe.sumelectthermalfe: -806.503901 hartree
dipole: 0.0000 0.0011 0.0000
dipole: 0.0011
quadrupole: -124.6358 -107.7720 -110.0920
quadrupole: 0.0112 24.3958 -0.0005
quadrupole: -10.4692 6.3946 4.0746 0.0112 24.3958 -0.0005
hfenergy: -806.8257306 hartree
pointgroup: C01 [X(C14H24N2O2)]
dipole: 0.0000026 -0.0004255 0. debye
polarizability: 187.221888|-0.1125085|148.4066575|-1.7691332|-0.0034761|150.0488947 unknown
InChI: InChI=1S/C14H24N2O2/c1-11(17)15-13-7-3-5-9-14(13,16-12(2)18)10-6-4-8-13/h15-16H,3-10H2,1-2H3
charge 0 multiplicity 1
42 atoms
O  3.559601 -0.016853 1.047386
O  -3.559637 0.007818 -1.047426
N  1.814638 -0.009343 -0.512891
N  -1.814673 -0.000213 0.512847
C  0.662664 -0.007362 0.438516
C  -0.662699 -0.002242 -0.43856
C  0.731866 -1.302943 1.304672
C  0.739382 1.285368 1.308388
C  -0.739437 -1.294981 -1.308424
C  -0.731876 1.293331 -1.304724
C  0.622512 -2.584608 0.445902
C  0.637663 2.570034 0.453229
C  -0.637703 -2.579644 -0.453263
C  -0.622538 2.574998 -0.445956
C  3.152331 -0.013795 -0.156184
C  -3.152366 0.004444 0.156143
C  4.117945 -0.014534 -1.346361
C  -4.117978 0.005138 1.346321
H  -0.080376 -1.289644 2.060033
H  1.683246 -1.287764 1.865139
H  1.690568 1.263025 1.868935
H  -0.073035 1.274645 2.06359
H  0.072957 -1.284266 -2.06365
H  -1.690636 -1.272637 -1.86895
H  -1.683244 1.278153 -1.865214
H  0.080389 1.280021 -2.060059
H  0.614504 -3.472187 1.107132
H  1.527745 -2.670789 -0.187132
H  1.543391 2.652621 -0.179572
H  0.634853 3.455811 1.116906
H  -0.634902 -3.465423 -1.116937
H  -1.54342 -2.662233 0.179552
H  -1.527781 2.661178 0.187064
H  -0.614519 3.462575 -1.107188
H  1.603419 -0.006833 -1.511804
H  -1.603454 -0.002869 1.51176
H  5.148257 -0.017522 -0.96238
H  3.971999 -0.90846 -1.980891
H  3.976325 0.881688 -1.978626
H  -5.148288 0.009301 0.962342
H  -3.977137 -0.891723 1.977855
H  -3.971256 0.898418 1.981578
