program: Gaussian 09
title: 000282598
version: EM64L-G09RevD.01
frameworkgroup: C1[X(C19H14ClNO4)]
method: RPBEPBE
basis: SDD
operation: Freq
keyword: #p
keyword: freq=noraman
keyword: PBEPBE/SDD
title: #p freq=noraman PBEPBE/SDD
converged: YES YES NO NO
title: Mulliken charges:
elementType: Cl O O O O N C C C C C C C C C C C C C C C C C C C H H H H H H H H H H H H H H
charge: 0.059291 -0.295779 -0.172537 -0.171475 -0.215739 -0.312246 0.535430 0.312523 0.279440 -0.062412 0.327537 -0.633532 0.004191 -0.378637 0.245080 -0.366332 0.213410 -0.302478 -0.228383 -0.226363 -0.332887 -0.248344 -0.772290 -0.235456 -0.532120 0.292234 0.294372 0.260026 0.243480 0.243961 0.240014 0.232152 0.256590 0.279083 0.236807 0.228192 0.232140 0.225058 0.246000
chargesum: 0.00000
title: Mulliken charges with hydrogens summed into heavy atoms:
elementType: Cl O O O O N C C C C C C C C C C C C C C C C C C C
charge: 0.059291 -0.295779 -0.172537 -0.171475 -0.215739 -0.312246 0.535430 0.312523 0.279440 -0.062412 0.327537 -0.633532 0.004191 -0.086403 0.245080 -0.071960 0.213410 -0.042451 0.015097 0.017597 -0.092874 -0.016191 0.000189 -0.007263 0.171078
polarizability: 3.66443129e+02 1.39284945e+01 2.21067955e+02 -1.44754007e+01 1.94009936e+01 1.92697170e+02
1716.lowfreq: -4.8928 -3.1065 -0.0008 0.0008 0.0020 8.2858 23.0949 32.9666 43.9647
frequency: 23.0474 32.9596 43.9624 58.6824 67.3890 83.5709 91.7654 103.0339 124.0613 128.0628 152.9137 169.9098 180.5042 193.3946 203.7644 234.5268 245.8866 263.4137 291.5184 311.9449 320.9936 334.2441 369.8627 372.3784 393.4993 420.7273 439.5619 461.1558 469.6216 494.0790 508.2659 524.8965 539.5260 558.2205 584.5352 600.9765 619.6059 649.1897 692.1812 695.3060 719.7511 724.1959 745.6446 751.8294 774.8264 806.1397 822.6103 839.6650 843.1663 845.8775 910.0844 931.4098 935.0109 973.1347 984.9061 997.8179 999.1606 1009.3337 1015.4014 1037.6551 1042.9778 1051.1701 1081.8385 1111.5678 1114.9687 1119.3669 1151.4312 1172.8035 1175.5731 1180.0146 1219.2167 1219.8083 1238.6861 1268.7877 1278.3297 1289.3179 1307.8206 1382.4550 1383.7226 1400.2262 1428.4585 1439.8465 1445.7916 1454.7436 1461.2123 1467.2964 1470.2535 1471.5628 1487.2847 1534.6583 1555.4829 1557.2346 1590.3524 1597.0746 1601.0013 1607.1843 1621.3535 2968.5009 3006.8668 3061.5350 3109.7366 3112.9313 3127.7955 3138.3153 3139.3478 3153.8623 3157.0873 3164.3318 3169.6219 3173.8284 3184.7028
redmass: 6.4439 4.4463 6.6373 8.6195 9.9414 4.6756 3.6418 5.4325 4.8550 1.1535 3.7043 5.2675 4.5820 5.5550 4.7415 1.6383 4.1163 3.3885 6.3079 6.0044 9.4942 5.0514 6.7389 8.1491 5.9825 4.1516 4.7512 6.3169 5.0028 4.9168 4.5479 7.3593 4.1897 5.4162 4.6752 4.2137 6.7202 5.9299 5.0654 7.1947 4.1678 2.8997 3.0634 1.6272 5.1260 1.7351 8.8668 1.9191 2.3618 7.6322 4.2144 1.6543 1.4772 1.3277 8.7193 1.4860 1.7057 5.2305 1.3621 1.6829 2.1771 2.2492 3.0281 1.2896 2.0096 2.7965 1.4830 1.0871 1.0983 2.1181 4.7684 2.9415 2.3497 2.5700 2.3131 2.1378 5.3691 1.8522 2.5795 10.2577 1.4920 2.4319 1.6484 1.0769 1.0601 1.0589 1.6497 1.5958 2.0244 10.5890 10.0072 11.4237 7.3324 8.2900 6.5463 6.7903 9.8325 1.0321 1.0355 1.1046 1.0990 1.1001 1.1003 1.0860 1.0864 1.0903 1.0905 1.0947 1.0956 1.1004 1.0981
irintensity: 1.9157 0.3623 0.7446 2.5169 2.4733 4.2513 1.1660 6.1923 0.7592 0.8288 0.9293 0.5003 5.4877 0.7148 1.1333 0.9807 0.7924 0.2044 0.4184 4.2834 0.4693 1.9003 9.0788 15.6362 0.6828 2.1552 2.6476 6.5576 4.5418 6.5014 9.0007 2.1259 1.5379 6.0548 7.5698 1.4990 36.2705 6.9162 2.1763 1.3108 1.4813 74.9862 18.6872 39.3155 31.9144 30.9412 58.7991 8.3793 0.5481 0.8837 7.7895 2.0559 8.1482 3.2036 42.1123 15.2751 42.0489 30.1991 0.0295 11.4690 2.0957 22.9729 7.2131 3.9439 34.2378 105.3838 2.8829 17.1415 3.5031 4.6702 481.1979 77.3027 43.8505 142.9611 160.2595 14.1692 90.6655 52.3635 7.2034 1.8794 11.6141 2.1114 14.9427 31.1971 11.3316 13.7243 12.9766 44.9137 22.0538 155.5388 122.5391 373.9467 6.8147 62.4080 35.7485 1.5697 79.9832 56.4013 4.6511 28.0149 5.6331 13.8860 14.2402 1.7131 3.9869 5.6737 16.6068 0.9697 22.3907 27.2852 6.0328
temp: 298.150 k
press: 1.00000 atm
elementType: 17 8 8 8 8 7 6 6 6 6 6 6 6 6 6 6 6 6 6 6 6 6 6 6 6 1 1 1 1 1 1 1 1 1 1 1 1 1 1
symmnumber: 1
zpe: 743898.4 jmol-1
zpe.correction: 0.283336 hartree
zpe.thermalcorrener: 0.305659 hartree
zpe.thermalcorrenthalpy: 0.306603 hartree
zpe.thermalcorrgfe: 0.230890 hartree
zpe.sumelectzpe: -1546.362208 hartree
zpe.sumelectthermal: -1546.339885 hartree
zpe.sumelectthermalent: -1546.338941 hartree
zpe.sumelectthermalfe: -1546.414654 hartree
dipole: -3.3496 -1.7460 2.8485
dipole: 4.7310
quadrupole: -128.4896 -157.7342 -144.7705
quadrupole: -15.2234 -7.7654 -17.9081
quadrupole: 15.1752 -14.0695 -1.1057 -15.2234 -7.7654 -17.9081
hfenergy: -1546.6455443 hartree
pointgroup: C01 [X(C19H14Cl1N1O4)]
dipole: 1.3211755 -1.311021 0.0163577 debye
polarizability: 366.693731|-19.192346|182.8359523|-0.7211535|-0.1884938|230.6785697 unknown
InChI: InChI=1S/C19H14ClNO4/c1-11(22)21(14-9-5-6-10-15(14)25-2)17-16(20)18(23)12-7-3-4-8-13(12)19(17)24/h3-10H,1-2H3
charge 0 multiplicity 1
39 atoms
Cl -0.715787 1.504729 2.413643
O  -0.851714 -1.892686 -0.017348
O  0.692441 -0.049728 -2.330329
O  2.131467 0.773457 2.910266
O  -2.778557 1.571901 -2.20543
N  -1.296976 0.801617 -0.559299
C  0.046008 0.656792 -0.117682
C  2.43928 -0.106042 -0.66807
C  2.803468 0.086994 0.692076
C  1.045891 0.154292 -1.130793
C  -2.329515 0.002617 0.068307
C  0.439488 0.861784 1.191661
C  1.809937 0.583521 1.69673
C  3.404822 -0.560433 -1.599054
C  -2.111709 -1.384972 0.326319
C  4.128571 -0.179453 1.111307
C  -1.63476 1.627921 -1.687072
C  -3.577257 0.577273 0.395288
C  4.723799 -0.82556 -1.176637
C  5.085792 -0.634726 0.180664
C  -3.142568 -2.165139 0.901529
C  -4.606362 -0.202997 0.960103
C  -0.592458 2.631083 -2.156844
C  -4.385677 -1.574108 1.214463
C  -0.643707 -3.341861 0.063943
H  3.098263 -0.701066 -2.640266
H  4.381885 -0.020226 2.163922
H  -3.739703 1.638179 0.191099
H  5.468777 -1.179516 -1.896835
H  6.110629 -0.839723 0.507546
H  -2.982787 -3.228097 1.10374
H  -5.569172 0.257812 1.200841
H  -1.115469 3.572519 -2.391708
H  -0.123504 2.25986 -3.083148
H  0.197002 2.829304 -1.413682
H  -5.176984 -2.187975 1.657978
H  -1.379263 -3.884441 -0.559277
H  -0.699994 -3.696052 1.110887
H  0.370699 -3.504756 -0.328537
