program: Gaussian 09
title: 000282543
version: EM64L-G09RevD.01
frameworkgroup: C1[X(C20H11N3O2)]
method: RPBEPBE
basis: SDD
operation: Freq
keyword: #p
keyword: freq=noraman
keyword: PBEPBE/SDD
title: #p freq=noraman PBEPBE/SDD
converged: NO YES NO YES
title: Mulliken charges:
elementType: O O N N N C C C C C C C C C C C C C C C C C C C C H H H H H H H H H H H
charge: -0.204064 -0.199231 0.031727 0.035863 0.019979 0.276400 0.280614 0.365407 0.358154 -0.326411 -0.296154 0.121634 0.036683 -0.385814 -0.386262 -0.431603 -0.430332 -0.253782 -0.252649 -0.241218 -0.241825 -0.511878 -0.308956 0.422056 -0.371416 0.233085 0.233750 0.300002 0.298365 0.234502 0.234713 0.240924 0.240437 0.314736 0.270161 0.292401
chargesum: 0.00000
title: Mulliken charges with hydrogens summed into heavy atoms:
elementType: O O N N N C C C C C C C C C C C C C C C C C C C C
charge: -0.204064 -0.199231 0.031727 0.035863 0.019979 0.276400 0.280614 0.365407 0.358154 -0.326411 -0.296154 0.121634 0.036683 -0.152729 -0.152512 -0.131601 -0.131967 -0.019280 -0.017936 -0.000294 -0.001388 -0.197141 -0.038795 0.422056 -0.079016
polarizability: 5.03950637e+02 3.75493747e+00 3.13273684e+02 -1.88975421e-03 -3.59871443e-03 8.72271310e+01
1716.lowfreq: -8.3388 -7.6022 -0.0011 0.0003 0.0010 4.2116 33.6829 46.5930 68.1917
frequency: 33.6693 46.5914 68.1902 88.4771 100.1515 107.3053 134.5528 190.7366 200.1926 218.1853 245.7199 287.4270 310.5782 333.9498 345.2267 398.4170 407.0284 421.2096 444.2266 444.2279 452.9645 488.5859 510.7384 560.3162 570.4332 570.9257 575.6802 600.2409 607.0020 615.4149 629.9344 686.4083 690.6968 701.5498 718.8058 745.0695 751.3304 769.5172 779.1221 788.6578 810.3052 817.6197 849.5321 861.7668 899.4465 926.2814 942.1520 952.1309 976.8840 982.9697 983.2491 993.8516 999.2452 1011.4157 1014.0008 1033.3542 1045.7996 1056.5425 1067.4081 1107.5823 1126.1826 1128.6202 1177.4881 1180.0443 1200.4247 1206.8974 1227.3421 1244.0860 1264.1824 1286.8848 1295.3128 1302.9695 1322.3443 1356.8129 1371.1060 1387.1436 1398.0079 1408.7600 1437.1879 1440.7435 1447.5395 1460.5185 1487.5422 1497.8705 1501.4829 1549.0046 1563.0208 1587.0437 1610.9751 1612.8762 1620.9921 3134.3895 3136.4129 3150.1647 3154.5589 3162.8187 3165.5650 3169.8065 3175.3053 3177.4960 3189.5787 3192.9208
redmass: 7.0677 9.0899 6.3791 4.5046 7.8354 4.4206 5.4153 7.8730 6.2316 6.1732 5.3558 6.9429 4.9799 7.1027 5.3441 6.7036 8.2319 3.7877 4.1086 7.5349 3.4373 4.0031 7.0103 4.3755 7.9768 3.9667 3.5393 7.1020 8.5137 6.9181 8.1150 6.8030 7.1725 4.5434 3.1709 6.9616 2.1178 9.2167 2.1937 1.6933 2.1006 5.7284 1.5184 1.8928 1.4155 5.7186 1.5285 6.9793 1.4537 2.3563 1.6068 7.4254 1.3239 1.3607 1.5774 3.9931 1.8446 2.0420 2.9141 2.2113 1.5776 1.5561 1.0639 1.1075 3.0129 5.5248 1.7839 1.5923 4.5384 1.9712 2.4409 2.5013 4.5460 2.5532 11.7069 8.3530 9.9286 4.6795 4.0718 2.6056 3.3452 4.0089 3.3444 3.2464 7.1705 7.5127 6.6677 7.5884 5.9895 6.8224 7.1038 1.0858 1.0862 1.0906 1.0905 1.0957 1.0899 1.0929 1.0991 1.0985 1.0928 1.0962
irintensity: 0.4054 0.0054 0.3213 0.0849 0.4592 3.1169 2.5488 1.1079 1.0391 0.7959 0.4401 0.3629 0.0636 1.6713 0.0106 1.7784 1.4511 0.0825 11.2792 1.8209 0.3141 0.4330 2.3694 0.6369 3.5489 16.7280 1.7058 0.0318 4.0181 3.3370 0.5447 7.7750 6.8131 13.3227 8.2583 9.8726 79.6698 33.3522 0.7742 84.2594 1.8775 2.8277 13.6293 25.3766 0.7794 1.6125 27.6282 2.2790 0.0016 1.5260 3.9824 1.1200 0.2482 1.0880 0.0645 42.2157 9.2526 31.1271 7.5958 0.8002 1.8972 21.4465 1.5832 8.4625 83.7266 450.7918 47.2596 0.8434 22.4480 0.9659 15.9738 14.7586 1.5750 108.9389 88.8465 24.2562 38.1169 45.1468 7.5442 47.4185 26.3630 15.4464 19.4999 4.2952 22.6863 2.9335 1.2319 9.5960 65.7746 6.1501 9.7117 0.9645 3.6433 20.1861 1.6800 2.4176 5.5449 17.6434 30.0501 37.9123 3.6155 3.6053
temp: 298.150 k
press: 1.00000 atm
elementType: 8 8 7 7 7 6 6 6 6 6 6 6 6 6 6 6 6 6 6 6 6 6 6 6 6 1 1 1 1 1 1 1 1 1 1 1
symmnumber: 1
zpe: 684750.9 jmol-1
zpe.correction: 0.260808 hartree
zpe.thermalcorrener: 0.278330 hartree
zpe.thermalcorrenthalpy: 0.279274 hartree
zpe.thermalcorrgfe: 0.214782 hartree
zpe.sumelectzpe: -1081.733019 hartree
zpe.sumelectthermal: -1081.715497 hartree
zpe.sumelectthermalent: -1081.714552 hartree
zpe.sumelectthermalfe: -1081.779045 hartree
dipole: 7.2434 -1.4410 0.0004
dipole: 7.3854
quadrupole: -156.7443 -126.9974 -147.0217
quadrupole: 10.4010 -0.0033 -0.0001
quadrupole: -13.1565 16.5904 -3.4339 10.4010 -0.0033 -0.0001
hfenergy: -1081.9938268 hartree
pointgroup: C01 [X(C20H11N3O2)]
dipole: 2.8478899 -0.5763413 0.0001598 debye
polarizability: 503.9733181|3.1263922|313.2510036|-0.0019016|-0.0035925|87.227131 unknown
InChI: InChI=1S/C20H11N3O2/c24-23(25)12-9-10-17-18(11-12)22-20-16-8-4-2-6-14(16)13-5-1-3-7-15(13)19(20)21-17/h1-11H
charge 0 multiplicity 1
36 atoms
O  -6.638475 -0.368857 -0.000256
O  -5.805004 1.754894 -0.000245
N  -0.804323 1.143882 -0.000105
N  -0.417005 -1.704184 -0.00006
N  -5.657881 0.472602 -0.000034
C  2.930409 0.951197 -0.000155
C  3.130039 -0.513624 -0.00014
C  1.604305 1.496117 -0.000139
C  1.997804 -1.39429 -0.000107
C  0.440271 0.601773 -0.000112
C  0.637958 -0.845961 -0.000089
C  -1.877874 0.278799 -0.000074
C  -1.68211 -1.16162 -0.000052
C  4.024579 1.863935 -0.000182
C  4.428357 -1.100673 -0.000159
C  1.406523 2.905466 -0.000151
C  2.185372 -2.805745 -0.000089
C  3.818793 3.253474 -0.000193
C  4.602139 -2.494653 -0.000143
C  2.500995 3.781793 -0.000178
C  3.474079 -3.357071 -0.000106
C  -3.201794 0.81175 -0.00006
C  -2.823673 -2.027669 -0.000019
C  -4.276529 -0.076914 -0.000032
C  -4.111216 -1.499056 -0.000012
H  5.051828 1.490058 -0.000192
H  5.31814 -0.465491 -0.000189
H  0.378074 3.276255 -0.000139
H  1.293587 -3.438143 -0.000062
H  4.68027 3.929994 -0.000214
H  5.61348 -2.91537 -0.000157
H  2.341603 4.864892 -0.000187
H  3.610831 -4.44325 -0.000091
H  -3.357705 1.89291 -0.000076
H  -2.646902 -3.106975 -0.000006
H  -5.000545 -2.133441 0.000004
