program: Gaussian 09
title: 000282529
version: EM64L-G09RevD.01
frameworkgroup: C1[X(C15H18O3)]
method: RPBEPBE
basis: SDD
operation: Freq
keyword: #pfreq=noraman
keyword: PBEPBE/SDD
title: #p freq=noraman PBEPBE/SDD
converged: YES YES NO NO
title: Mulliken charges:
elementType: O O O C C C C C C C C C C C C C C C H H H H H H H H H H H H H H H H H H
charge: -0.237585 -0.193401 -0.201631 0.214793 -0.181109 -0.045683 -0.532418 -0.176917 -0.059773 -0.492748 0.065427 -0.190906 -0.795332 0.293262 -0.756373 -0.346800 0.077333 -0.682179 0.220803 0.245130 0.242149 0.226685 0.238319 0.233240 0.211399 0.236673 0.254074 0.223497 0.233517 0.251477 0.216972 0.221668 0.229213 0.264924 0.234284 0.258016
chargesum: 0.00000
title: Mulliken charges with hydrogens summed into heavy atoms:
elementType: O O O C C C C C C C C C C C C C C C
charge: -0.237585 -0.193401 -0.201631 0.214793 0.039694 0.199447 -0.063584 0.061403 0.173467 -0.044676 0.065427 0.063168 -0.086841 0.293262 -0.088520 -0.081876 0.077333 -0.189880
polarizability: 1.90444471e+02 -7.02845903e+00 1.83420575e+02 1.58605067e+00 1.26029617e+00 1.09427576e+02
1716.lowfreq: -18.4273 -13.5560 -4.0726 -0.0008 -0.0006 -0.0003 56.1026 64.9235 80.7430
frequency: 56.0488 64.8323 80.7056 94.3660 145.9666 178.1963 195.4243 213.7046 222.5916 237.4967 252.0757 271.1860 281.4104 299.5164 310.8736 320.8056 336.8891 370.9875 412.2791 415.8385 469.4807 494.1262 521.0515 559.5059 603.9388 608.5201 643.4995 674.9585 690.3379 700.7257 748.9021 754.9463 786.0147 807.1466 826.2316 858.3994 879.4845 898.5668 924.4340 945.8420 958.7369 966.2909 970.0035 980.3698 987.6096 1018.2420 1037.8187 1043.9617 1063.1760 1078.2586 1087.0617 1099.5332 1128.6832 1140.3949 1147.3812 1162.1933 1171.9488 1201.2457 1224.5827 1254.0526 1255.0809 1266.9465 1276.0771 1283.3912 1303.2072 1315.4424 1324.8199 1335.1401 1337.5303 1346.4981 1358.6633 1384.9104 1391.9749 1417.0564 1464.0908 1470.6022 1475.7534 1478.2568 1482.6718 1487.1945 1582.8496 1628.3831 1673.6785 1689.1066 2908.8358 2947.2043 2974.6053 2976.5224 2985.2984 2994.8825 3001.1422 3009.2283 3048.5485 3050.9771 3069.7389 3080.3556 3082.8267 3090.1247 3100.1323 3156.0771 3193.5253 3208.9658
redmass: 4.7894 3.6171 4.8413 4.1608 4.2353 5.1524 2.4002 4.3037 3.1175 1.6147 2.8075 1.3757 1.7822 3.5471 2.8974 3.0213 2.7708 3.9991 2.7238 3.4762 3.4019 4.0608 3.2477 3.0903 4.8781 2.9261 3.3543 3.3458 2.7694 5.0035 3.1600 3.0062 2.1077 2.5931 2.1370 2.0242 2.2137 1.7187 5.6118 1.8701 2.0373 1.7295 1.4059 1.4191 1.9364 2.1564 2.7074 2.7669 1.8576 2.3421 1.8915 2.6449 1.7191 2.2593 2.2010 1.6372 2.1867 2.3583 1.7074 2.0394 1.7265 1.4519 1.1942 1.3430 1.2823 1.3318 1.6053 1.4961 1.5190 1.5104 1.5710 1.1840 1.2043 1.1726 1.0844 1.0747 1.0501 1.0572 1.0599 1.0461 6.8100 11.0825 6.6762 11.8163 1.0804 1.0812 1.0528 1.0484 1.0355 1.0605 1.0819 1.0843 1.1017 1.1003 1.0983 1.0994 1.1000 1.0990 1.0617 1.0885 1.1050 1.1155
irintensity: 6.3851 0.0524 1.2790 3.5072 1.6761 2.6640 0.7391 0.7738 1.1689 0.7037 0.4818 0.3230 1.3920 0.9220 2.1477 2.0225 1.6398 1.9780 1.8013 0.9582 2.5111 12.7259 0.7805 1.1377 7.5971 2.6958 3.7912 11.1542 4.6086 2.2529 11.7185 3.9464 6.8239 12.0327 16.5663 27.8754 8.4522 3.4817 125.5493 5.2267 10.6536 16.3623 2.0097 43.0255 4.3021 19.3562 100.6374 68.0601 12.1448 5.7988 2.4859 3.0251 6.9350 12.1998 6.5282 7.0674 4.6203 32.9641 29.7130 59.7039 3.9820 3.2656 2.2898 5.1646 4.1206 1.8647 4.9210 11.1164 4.4826 0.1860 9.9245 22.2597 12.1805 28.8667 7.2876 9.0580 8.0768 8.6459 6.3384 14.7766 9.2762 210.0885 26.5064 292.9845 12.8478 8.6659 5.2834 34.0292 13.5617 11.6923 15.2456 37.8565 3.2113 33.7385 51.5742 35.0119 18.7517 27.8025 3.0906 6.6787 11.0036 2.8266
temp: 298.150 k
press: 1.00000 atm
elementType: 8 8 8 6 6 6 6 6 6 6 6 6 6 6 6 6 6 6 1 1 1 1 1 1 1 1 1 1 1 1 1 1 1 1 1 1
symmnumber: 1
zpe: 776299.7 jmol-1
zpe.correction: 0.295677 hartree
zpe.thermalcorrener: 0.312053 hartree
zpe.thermalcorrenthalpy: 0.312997 hartree
zpe.thermalcorrgfe: 0.252965 hartree
zpe.sumelectzpe: -806.693437 hartree
zpe.sumelectthermal: -806.677061 hartree
zpe.sumelectthermalent: -806.676117 hartree
zpe.sumelectthermalfe: -806.736149 hartree
dipole: -4.8796 2.1971 -0.4812
dipole: 5.3730
quadrupole: -133.2829 -112.7806 -103.4694
quadrupole: -19.3525 0.3237 -0.1550
quadrupole: -16.7719 3.7304 13.0415 -19.3525 0.3237 -0.1550
hfenergy: -806.989114 hartree
pointgroup: C01 [X(C15H18O3)]
dipole: 1.8971239 -0.9147838 -0.1806484 debye
polarizability: 190.0800974|-7.1918889|183.8176679|-1.0552162|-0.8117767|109.3948567 unknown
InChI: InChI=1S/C15H18O3/c1-8-6-12-10(9(2)14(17)18-12)7-15(3)11(8)4-5-13(15)16/h4-5,8,10-12H,2,6-7H2,1,3H3
charge 0 multiplicity 1
36 atoms
O  -2.77621 -1.201033 0.334453
O  2.67951 2.748803 0.037004
O  -4.74404 -0.024797 -0.094276
C  1.371892 0.635832 0.376577
C  1.61142 -0.716862 -0.404535
C  1.024101 -2.017684 0.225576
C  0.024645 1.359529 0.069773
C  -1.122546 0.427948 -0.382387
C  -1.313677 -0.862197 0.47093
C  -0.519328 -2.09471 0.027155
C  2.604475 1.493581 -0.048037
C  3.109493 -0.684118 -0.690782
C  1.550609 0.458837 1.920453
C  -2.513312 1.0456 -0.360448
C  1.65718 -3.297233 -0.375723
C  3.651286 0.559178 -0.531666
C  -3.502058 -0.042004 -0.046733
C  -2.897409 2.328024 -0.571302
H  1.12675 -0.621291 -1.404739
H  1.242322 -2.016012 1.311265
H  0.19112 2.125775 -0.711026
H  -0.299296 1.914451 0.969971
H  -0.927963 0.094662 -1.424713
H  -1.156341 -0.645494 1.544634
H  -0.738488 -2.27755 -1.044892
H  -0.905118 -2.969862 0.583157
H  3.65151 -1.558042 -1.065253
H  0.696938 -0.072412 2.374229
H  2.474229 -0.095346 2.165867
H  1.61436 1.456033 2.391655
H  1.577502 -3.304457 -1.480004
H  2.723284 -3.397572 -0.106491
H  1.137279 -4.196858 0.000575
H  4.673419 0.871545 -0.757442
H  -2.179553 3.125477 -0.79094
H  -3.959687 2.593455 -0.521082
