program: Gaussian 09
title: 000282555
version: EM64L-G09RevD.01
frameworkgroup: C1[X(C17H18N2O2S)]
method: RPBEPBE
basis: SDD
operation: Freq
keyword: #p
keyword: freq=noraman
keyword: PBEPBE/SDD
title: #p freq=noraman PBEPBE/SDD
converged: YES YES NO NO
title: Mulliken charges:
elementType: S O O N N C C C C C C C C C C C C C C C C C H H H H H H H H H H H H H H H H H H
charge: 0.954901 -0.539737 -0.518317 0.013756 -0.487201 0.160121 -0.537632 -0.538655 0.388438 -0.268265 -0.419919 -0.422551 -0.225473 -0.225300 -0.239765 -0.035737 -0.236806 -0.235714 0.451416 -0.364381 -0.361745 -0.798997 0.263836 0.240493 0.241476 0.272590 0.235688 0.246075 0.248555 0.227270 0.228045 0.230164 0.294909 0.282007 0.284786 0.243621 0.243733 0.230291 0.229930 0.244092
chargesum: 0.00000
title: Mulliken charges with hydrogens summed into heavy atoms:
elementType: S O O N N C C C C C C C C C C C C C C C C C
charge: 0.954901 -0.539737 -0.518317 0.013756 -0.192292 0.160121 -0.033303 -0.024588 0.388438 -0.032577 -0.173844 -0.173996 0.001797 0.002745 -0.009601 -0.035737 0.045201 0.049072 0.451416 -0.120759 -0.118012 -0.094684
polarizability: 3.30580646e+02 -1.59291295e+01 2.12947316e+02 -6.07172339e+00 -1.44329407e-01 1.85400566e+02
1716.lowfreq: -11.8472 -10.9069 -0.7282 -0.0013 0.0004 0.0005 4.4980 12.5471 14.0345
frequency: -11.6410 12.0895 12.9660 28.3351 34.0711 46.1989 64.3108 78.0777 114.0832 132.1047 141.4018 164.1974 173.7580 189.5429 220.4576 233.3170 267.0987 286.4172 298.2370 300.6495 348.9126 368.2573 387.7586 395.2815 403.6769 407.0356 421.9814 484.1509 510.7661 523.9551 536.7176 585.2284 616.1158 620.7651 622.7487 706.6856 707.7985 711.8402 764.7554 776.5506 786.3730 810.8590 813.3296 817.3460 829.5686 849.7202 857.1991 870.6993 906.7892 924.6191 947.7999 957.9812 964.1880 979.7470 982.8224 989.7352 991.3865 991.9681 995.2504 998.9343 1015.0059 1024.6187 1049.5119 1054.2482 1072.6057 1076.6943 1093.7395 1098.9775 1119.7535 1172.3148 1180.9248 1183.9061 1185.2830 1218.3939 1265.5284 1274.2617 1297.5790 1312.2124 1324.8950 1374.3480 1380.6870 1382.2065 1392.3199 1399.1381 1431.7135 1433.6427 1453.9234 1471.2712 1473.7101 1474.5683 1487.4931 1571.2530 1588.4149 1595.3955 1596.4996 1613.7234 2980.5459 3005.9016 3063.2055 3092.4374 3093.4817 3100.0970 3121.1622 3124.6600 3136.2600 3136.8881 3137.9561 3147.0905 3163.6816 3164.4418 3168.6040 3198.8238 3199.7387 3216.2398
redmass: 3.8304 4.7487 5.2213 3.3491 1.0719 5.8720 6.8829 3.9959 3.6375 6.1426 4.6895 5.3675 4.6234 6.0548 4.8238 5.2611 4.0686 4.5581 4.7497 4.0995 3.4537 3.4349 5.1927 8.7640 2.8270 2.8625 6.6718 3.3812 3.1655 4.0195 3.4127 5.3652 6.4078 6.8292 4.0347 1.7373 3.2356 3.3725 1.8946 4.2622 2.0034 1.9107 2.1559 3.7914 1.4015 1.2443 1.2526 2.4824 1.8331 1.4495 11.3666 1.2224 1.3144 1.3818 1.4199 3.4717 1.6047 3.7557 2.5331 1.8421 2.7748 2.4316 1.5955 2.4862 1.1846 1.4961 1.4054 2.2239 1.2875 1.0536 1.2982 1.1128 1.1399 3.0441 1.7943 1.5764 1.2623 1.3502 2.5934 7.9465 1.8038 5.7164 2.9403 1.2203 1.0961 2.1684 1.2581 1.1021 2.1097 1.1157 2.5419 7.2648 6.1763 6.0650 6.8990 6.1635 1.0390 1.0887 1.0947 1.1001 1.0498 1.0611 1.0848 1.0877 1.0894 1.0920 1.0897 1.0965 1.1016 1.0957 1.0963 1.0740 1.1181 1.1164
irintensity: 0.0706 0.2935 0.8839 0.0724 0.7125 0.3424 0.1805 2.5778 2.9841 3.7654 4.8042 11.3380 3.2198 5.0164 10.0685 6.7942 0.4771 22.2264 1.8667 3.9130 2.3339 0.5116 9.3269 58.3506 0.0581 0.2064 81.4350 63.2359 56.3754 4.3765 13.3390 19.7579 0.0090 0.2296 7.0720 37.9198 1.0542 41.2295 110.0555 6.0293 73.9260 45.3219 64.0869 4.9777 25.9576 0.2076 0.1839 39.4143 17.3240 5.3608 74.2621 4.3282 1.4688 0.3486 4.0465 44.0732 4.0500 19.3262 10.3850 35.8303 28.1550 3.8255 25.7325 25.1780 25.1275 15.7189 1.6149 4.9572 7.5682 0.0086 0.0444 1.3737 11.8701 6.8149 3.4082 18.3107 2.7391 0.7839 25.1087 0.0805 19.8055 1.7396 10.5930 16.4447 14.8880 5.6896 13.3725 16.6905 21.4672 15.1856 13.1873 33.1034 1.4045 12.0675 1.1272 9.2726 24.8735 33.3702 17.5458 14.8443 11.6233 8.7938 5.7423 0.1890 14.3186 16.5772 7.7972 37.8678 26.8492 2.1875 7.2789 13.7770 0.0742 16.7013
temp: 298.150 k
press: 1.00000 atm
elementType: 16 8 8 7 7 6 6 6 6 6 6 6 6 6 6 6 6 6 6 6 6 6 1 1 1 1 1 1 1 1 1 1 1 1 1 1 1 1 1 1
symmnumber: 1
zpe: 809612.2 jmol-1
zpe.correction: 0.308365 hartree
zpe.thermalcorrener: 0.329605 hartree
zpe.thermalcorrenthalpy: 0.330549 hartree
zpe.thermalcorrgfe: 0.254139 hartree
zpe.sumelectzpe: -1314.787967 hartree
zpe.sumelectthermal: -1314.766726 hartree
zpe.sumelectthermalent: -1314.765782 hartree
zpe.sumelectthermalfe: -1314.842192 hartree
dipole: -0.8977 -5.1430 -1.4408
dipole: 5.4159
quadrupole: -109.4718 -142.9981 -135.7495
quadrupole: -23.0124 -1.5766 -2.2409
quadrupole: 19.9346 -13.5916 -6.3430 -23.0124 -1.5766 -2.2409
hfenergy: -1315.0963315 hartree
pointgroup: C01 [X(C17H18N2O2S1)]
dipole: -0.5847277 -1.8987822 0.7700498 debye
polarizability: 323.3070081|-19.6425222|203.4097427|26.599002|-17.4000207|202.2117767 unknown
InChI: InChI=1S/C17H18N2O2S/c1-14-7-9-16(10-8-14)22(20,21)19-18-13-17(11-12-17)15-5-3-2-4-6-15/h2-10,13,19H,11-12H2,1H3
charge 0 multiplicity 1
40 atoms
S  2.248648 1.490838 -1.11277
O  3.08427 1.766509 -2.483103
O  1.76359 2.695947 -0.132497
N  -0.261867 0.38896 -0.818726
N  0.729591 0.456127 -1.773088
C  -2.584812 0.133313 -0.108438
C  -2.188126 -0.539285 1.230927
C  -2.393562 0.96942 1.18828
C  -3.976624 -0.073302 -0.660955
C  -1.524817 0.263383 -1.1566
C  -4.452645 -1.378985 -0.943434
C  -4.805347 1.036873 -0.96323
C  -5.733142 -1.572637 -1.508773
C  -6.086644 0.847239 -1.528675
C  -6.554017 -0.459019 -1.804118
C  3.133158 0.207474 -0.073542
C  4.01936 -0.669425 -0.717956
C  2.889752 0.192819 1.308324
C  4.487429 -1.680007 1.484214
C  4.696364 -1.616868 0.080221
C  3.579163 -0.766305 2.08213
C  5.24573 -2.682922 2.333992
H  -1.159638 -0.906573 1.292172
H  -2.94906 -1.150358 1.725836
H  -3.295325 1.381623 1.65106
H  -1.503431 1.604388 1.220845
H  -1.859822 0.23248 -2.211381
H  -3.816477 -2.241718 -0.711776
H  -4.443133 2.048935 -0.746158
H  -6.090582 -2.587222 -1.718362
H  -6.718464 1.713896 -1.753859
H  -7.547901 -0.607825 -2.241015
H  0.499703 0.902618 -2.693513
H  4.181554 -0.602559 -1.798373
H  2.197898 0.912314 1.756726
H  5.395728 -2.314856 -0.393908
H  3.408473 -0.804777 3.164097
H  4.657647 -2.996855 3.213793
H  5.51123 -3.585845 1.757582
H  6.189847 -2.243312 2.710049
