program: Gaussian 09
title: 000282556
version: EM64L-G09RevD.01
frameworkgroup: C1[X(C22H12N2O3)]
method: RPBEPBE
basis: SDD
operation: Freq
keyword: #p
keyword: freq=noraman
keyword: PBEPBE/SDD
title: #p freq=noraman PBEPBE/SDD
converged: YES YES NO NO
title: Mulliken charges:
elementType: O O O N N C C C C C C C C C C C C C C C C C C C C C C H H H H H H H H H H H H
charge: -0.176191 -0.187302 -0.169736 -0.027091 0.008095 0.150615 0.252532 0.267492 0.025972 0.235402 -0.232344 0.228604 -0.377471 -0.355350 0.179378 -0.395936 -0.364710 -0.244400 -0.238553 0.306000 -0.238341 -0.331359 -0.368285 -0.307390 -0.244894 -0.237885 -0.229846 0.276023 0.259813 0.290271 0.274954 0.251074 0.240799 0.242487 0.277617 0.251167 0.237441 0.235131 0.236219
chargesum: 0.00000
title: Mulliken charges with hydrogens summed into heavy atoms:
elementType: O O O N N C C C C C C C C C C C C C C C C C C C C C C
charge: -0.176191 -0.187302 -0.169736 -0.027091 0.008095 0.150615 0.252532 0.267492 0.025972 0.235402 -0.232344 0.228604 -0.101448 -0.095536 0.179378 -0.105665 -0.089756 0.006674 0.002246 0.306000 0.004146 -0.053742 -0.117118 -0.307390 -0.007453 -0.002754 0.006373
polarizability: 4.35935141e+02 4.23554514e+00 2.96772008e+02 -1.02434176e+01 -8.60947926e+00 1.67860115e+02
1716.lowfreq: -6.2449 -0.0004 0.0003 0.0008 2.8738 5.1333 21.8949 36.7995 47.1472
frequency: 21.8533 36.7834 47.1426 56.8079 65.2573 86.1182 91.3250 107.0460 133.2616 160.5732 169.2874 173.4360 188.5884 217.2473 235.4438 296.2264 302.8272 325.7943 334.1297 352.4619 379.5572 402.3893 412.6699 422.3046 441.5490 454.7723 470.5118 486.2994 512.7973 558.4010 568.9990 601.2168 611.4148 623.0541 631.3560 656.3811 665.7363 682.5938 693.6504 697.5460 717.2561 730.2013 749.4224 774.0818 777.7048 791.2131 800.9173 811.8904 829.5042 845.3707 900.9082 918.0684 926.6554 928.9181 976.0009 979.0759 983.7240 988.5073 992.6169 1000.4812 1003.9228 1021.0889 1034.9239 1050.7734 1064.4104 1092.1654 1097.1833 1115.6667 1153.7717 1177.3226 1182.4799 1202.2004 1202.6665 1225.6850 1231.1752 1258.2914 1269.2447 1292.2359 1301.2646 1331.7223 1363.1172 1369.7071 1380.9077 1385.3609 1429.9116 1431.6993 1433.0004 1457.0518 1478.5704 1484.9578 1500.8693 1558.0622 1560.4391 1576.4104 1584.8914 1594.0136 1604.9895 1611.3484 2147.4475 3132.3567 3140.7457 3140.8360 3153.8464 3154.2388 3156.7078 3165.3535 3168.3007 3171.5655 3176.2069 3185.1693 3203.5304
redmass: 7.4045 6.9641 10.3736 6.5966 7.6120 5.2392 5.4290 6.9092 9.0164 5.7511 7.2962 7.4328 5.8717 5.6650 5.8754 6.3651 7.1580 6.4104 6.9989 7.0748 7.6260 3.7843 4.5011 5.2673 5.1065 6.7260 8.1796 4.6919 4.4847 3.3775 7.5562 6.8368 6.5483 6.5128 7.1285 6.7887 6.8555 8.0417 3.7622 2.3993 4.5457 2.5744 5.6467 2.0809 1.7182 4.7773 1.9272 4.0357 4.9954 1.2382 1.4344 7.0950 1.4196 1.3893 1.3869 1.4113 1.3825 6.1579 6.3301 1.3404 1.3595 3.5794 3.8187 3.0195 2.5176 1.9416 1.9624 1.8532 2.0152 1.0569 1.0890 1.3346 1.1732 3.1590 5.2001 3.0291 2.7528 3.6174 1.8195 1.4053 7.5785 10.8432 7.1432 7.8572 2.3908 2.5865 2.4391 2.8507 2.2224 2.9474 9.3827 6.1078 9.1130 5.6636 7.5275 6.7946 5.8855 6.7654 12.6573 1.0856 1.0861 1.0894 1.0901 1.0944 1.0871 1.0952 1.1000 1.0923 1.1004 1.0997 1.0950
irintensity: 0.5837 1.1852 1.9583 2.1481 0.8388 1.9600 3.2208 1.0396 3.2973 0.3266 1.8259 2.7935 0.8737 1.1733 0.2413 1.2799 2.5452 1.2564 1.2284 4.4767 0.8942 1.7463 0.5741 1.1286 2.6966 10.9914 0.8461 8.5138 5.0482 1.5524 0.7937 1.3585 2.7837 11.6735 18.6073 7.2703 5.9702 9.1406 30.2404 26.5542 4.7457 57.9479 5.8209 33.9823 15.8430 19.2753 50.3734 2.1119 11.7114 7.4109 0.7955 1.1229 1.4939 1.7302 3.0807 1.2389 1.7290 6.3029 2.3101 0.1304 0.6620 7.9743 16.7346 6.7768 10.4885 3.7911 4.7383 22.6441 1.3010 0.2996 0.2101 0.4551 26.3526 15.5762 276.7740 14.4919 27.9885 39.1566 8.1653 3.7708 22.5040 125.6396 0.7108 6.8520 1.4795 33.7528 15.2143 11.7856 6.4054 9.2826 132.2994 1.3793 114.6686 2.8084 41.9925 2.5507 38.5107 10.1336 11.2166 0.1149 1.1369 2.6091 6.4832 19.6456 3.4550 8.0111 37.6576 1.1277 21.2573 3.9027 3.2579
temp: 298.150 k
press: 1.00000 atm
elementType: 8 8 8 7 7 6 6 6 6 6 6 6 6 6 6 6 6 6 6 6 6 6 6 6 6 6 6 1 1 1 1 1 1 1 1 1 1 1 1
symmnumber: 1
zpe: 729764.7 jmol-1
zpe.correction: 0.277953 hartree
zpe.thermalcorrener: 0.299156 hartree
zpe.thermalcorrenthalpy: 0.300100 hartree
zpe.thermalcorrgfe: 0.226641 hartree
zpe.sumelectzpe: -1178.806466 hartree
zpe.sumelectthermal: -1178.785262 hartree
zpe.sumelectthermalent: -1178.784318 hartree
zpe.sumelectthermalfe: -1178.857777 hartree
dipole: 3.0704 0.9580 0.0130
dipole: 3.2164
quadrupole: -154.6737 -144.8060 -156.1125
quadrupole: 7.1434 -3.9429 15.9587
quadrupole: -2.8096 7.0580 -4.2484 7.1434 -3.9429 15.9587
hfenergy: -1179.0844182 hartree
pointgroup: C01 [X(C22H12N2O3)]
dipole: -1.2053433 -0.3852596 -0.0006787 debye
polarizability: 436.2801992|5.0248541|292.6850708|1.3988909|24.263679|171.6019944 unknown
InChI: InChI=1S/C22H12N2O3/c23-13-18(14-7-2-1-3-8-14)21-17-11-6-12-19(24(26)27)20(17)15-9-4-5-10-16(15)22(21)25/h1-12H
charge 0 multiplicity 1
39 atoms
O  -1.436829 -1.551186 -1.603065
O  5.392204 0.901713 0.433083
O  4.594975 -0.370017 -1.288016
N  4.442571 0.491612 -0.341943
N  -1.725799 2.779571 2.091355
C  1.904322 0.354392 -0.130159
C  0.671408 1.090357 -0.207957
C  1.841682 -1.119674 0.012589
C  -0.618034 0.363524 -0.288696
C  0.660603 -1.785543 -0.437005
C  -0.540094 -1.017233 -0.883145
C  3.103696 1.119196 -0.176295
C  0.693667 2.509345 -0.286826
C  2.880857 -1.906175 0.575862
C  -1.797924 0.830079 0.306849
C  0.573916 -3.200268 -0.415226
C  3.122812 2.528349 -0.177454
C  1.901937 3.227794 -0.23589
C  2.774527 -3.309921 0.628606
C  -3.175352 0.280304 0.168209
C  1.630569 -3.965911 0.110393
C  -3.72216 -0.077652 -1.097406
C  -4.004347 0.184897 1.326033
C  -1.715504 1.913566 1.264093
C  -5.050601 -0.543531 -1.19181
C  -5.32147 -0.299831 1.227879
C  -5.850548 -0.667279 -0.033822
H  -0.244963 3.054617 -0.414562
H  3.772179 -1.435248 0.998646
H  -0.339832 -3.667578 -0.795101
H  4.083473 3.050593 -0.176883
H  1.895932 4.320593 -0.27691
H  3.586837 -3.894534 1.072804
H  1.559575 -5.057905 0.142176
H  -3.115879 0.028844 -1.997567
H  -3.607045 0.479723 2.303794
H  -5.458333 -0.808429 -2.172823
H  -5.937851 -0.384691 2.1290
H  -6.879973 -1.034055 -0.111905
