program: Gaussian 09
title: 000282520
version: EM64L-G09RevD.01
frameworkgroup: C1[X(C12H22O6)]
method: RPBEPBE
basis: SDD
operation: Freq
keyword: #pfreq=noraman
keyword: PBEPBE/SDD
title: #p freq=noraman PBEPBE/SDD
converged: YES YES NO NO
title: Mulliken charges:
elementType: O O O O O O C C C C C C C C C C C C H H H H H H H H H H H H H H H H H H H H H H
charge: -0.300054 -0.305108 -0.292712 -0.290742 -0.432814 -0.426347 -0.092658 -0.133959 -0.126356 -0.105837 0.357664 0.359033 -0.381802 -0.382664 -0.718495 -0.678773 -0.723092 -0.679614 0.243607 0.208986 0.273678 0.299897 0.223886 0.219307 0.196293 0.242677 0.213857 0.217290 0.284936 0.222000 0.219105 0.227201 0.209612 0.285893 0.221130 0.221042 0.223730 0.223378 0.342624 0.334199
chargesum: 0.00000
title: Mulliken charges with hydrogens summed into heavy atoms:
elementType: O O O O O O C C C C C C C C C C C C
charge: -0.300054 -0.305108 -0.292712 -0.290742 -0.090190 -0.092148 0.150949 0.075027 0.147322 0.194061 0.357664 0.359033 0.061391 0.056307 -0.002411 -0.010466 -0.006457 -0.011464
polarizability: 1.53231227e+02 6.66402495e+00 1.43025508e+02 -6.25940921e-01 -1.43402111e-01 1.43624373e+02
1716.lowfreq: 0.0004 0.0006 0.0007 5.7769 9.4792 16.9403 30.9530 59.4567 70.0562
frequency: 30.8677 59.3387 70.0462 81.7744 97.3415 107.3427 115.6728 121.7518 152.2826 163.0902 168.8632 174.5477 204.3180 232.1656 238.9755 270.8948 300.1676 306.5162 311.5532 317.4886 334.4224 342.2711 356.0855 386.9866 408.7972 410.8413 432.5886 440.6892 484.2995 492.9637 604.9278 616.8432 672.7498 687.1498 724.2643 729.1763 754.0405 757.2304 772.1664 793.2060 882.1312 920.3590 922.0983 927.3650 934.4252 945.3189 960.6782 965.8600 972.7069 982.4792 983.4490 985.5915 997.2330 1042.9626 1051.6127 1059.9428 1071.2361 1089.1917 1136.2684 1137.4614 1152.5018 1162.4901 1210.8421 1214.6443 1229.8303 1237.0169 1251.0782 1261.5527 1283.8333 1290.2240 1302.9199 1309.5151 1332.9385 1342.6857 1356.2891 1366.8494 1372.2513 1380.7331 1382.4942 1383.1807 1396.7495 1397.7517 1451.3340 1453.1294 1453.8872 1457.0594 1467.1874 1471.2428 1474.3154 1476.6123 1480.5947 1494.4698 2968.5586 2979.8301 2991.9550 2994.7257 2996.0639 3001.7392 3002.4320 3029.3680 3042.4072 3082.3532 3092.6932 3093.7813 3095.1820 3101.5998 3103.1714 3103.5975 3108.6542 3111.4170 3113.3513 3114.8207 3554.0258 3557.6202
redmass: 4.9716 4.9290 4.3873 3.6261 3.3971 3.6375 3.5237 4.0062 4.3896 1.0580 1.2090 2.0223 2.0188 1.2122 1.2554 2.3642 2.8850 1.9842 2.0941 2.5588 1.9365 2.8460 1.6031 2.9340 3.8535 3.5453 3.2948 3.0209 4.1500 4.1310 3.7191 4.5977 4.7161 7.0240 7.3696 6.5064 3.3468 3.2255 5.3898 3.1007 2.4622 1.5271 1.5286 2.8796 2.7484 3.0901 4.5175 5.1153 2.9613 1.3313 1.3822 2.6887 3.7381 1.9183 3.9659 2.0895 2.3869 2.8558 1.7783 1.8414 1.3095 1.3532 2.6690 2.6658 2.4325 3.5869 1.5450 1.3719 1.3325 1.3744 1.2217 1.3668 1.1826 1.1846 1.2217 1.2169 1.2718 1.2602 1.3090 1.2544 1.2116 1.2079 1.0497 1.0498 1.0512 1.0512 1.0795 1.0617 1.0798 1.0669 1.0502 1.0480 1.0685 1.0850 1.0651 1.0355 1.0354 1.0357 1.0359 1.0870 1.0864 1.0857 1.0995 1.0997 1.0997 1.0968 1.0991 1.0994 1.1014 1.1007 1.0998 1.0997 1.0663 1.0663
irintensity: 0.2086 0.6107 0.0165 4.2349 0.9407 2.4084 6.9927 1.1824 0.4918 0.0134 2.3116 7.1089 2.0698 3.8713 0.9115 50.8223 9.7728 101.9218 39.3937 4.5943 45.2898 6.9200 119.3975 14.1222 10.6266 14.0177 16.2847 15.5350 34.6891 3.1090 0.2968 0.0163 2.9304 0.4617 10.7176 8.7145 44.3917 7.0461 14.0962 30.0535 6.8610 2.7050 1.1531 43.1675 2.6537 9.4418 64.3578 101.3772 86.2523 0.8910 8.6022 75.9035 71.9648 12.5352 6.7745 31.7681 8.9538 36.6673 50.7849 24.3294 36.3907 21.2991 210.9312 76.5939 55.5736 31.6197 7.6891 4.6312 8.4779 3.6099 4.0913 14.9047 1.4496 2.7798 9.7161 4.5753 9.9064 36.1959 8.5300 26.5745 32.6146 35.0596 2.7656 2.8083 4.0373 5.8408 4.2301 1.2970 4.9646 1.6191 18.0879 7.4282 52.6242 40.4369 42.4511 12.0831 14.3108 34.5891 15.6802 32.1852 10.4982 4.5135 2.2328 0.6960 28.6868 5.8919 39.4780 29.0721 3.7754 4.7224 23.0525 26.9118 7.1024 8.1125
temp: 298.150 k
press: 1.00000 atm
elementType: 8 8 8 8 8 8 6 6 6 6 6 6 6 6 6 6 6 6 1 1 1 1 1 1 1 1 1 1 1 1 1 1 1 1 1 1 1 1 1 1
symmnumber: 1
zpe: 874665.3 jmol-1
zpe.correction: 0.333142 hartree
zpe.thermalcorrener: 0.353453 hartree
zpe.thermalcorrenthalpy: 0.354398 hartree
zpe.thermalcorrgfe: 0.285424 hartree
zpe.sumelectzpe: -920.302803 hartree
zpe.sumelectthermal: -920.282492 hartree
zpe.sumelectthermalent: -920.281547 hartree
zpe.sumelectthermalfe: -920.350522 hartree
dipole: -0.4642 2.3877 -0.8126
dipole: 2.5645
quadrupole: -109.7816 -110.2943 -111.1117
quadrupole: 8.4858 2.0126 2.6657
quadrupole: 0.6143 0.1016 -0.7159 8.4858 2.0126 2.6657
hfenergy: -920.6359451 hartree
pointgroup: C01 [X(C12H22O6)]
dipole: 0.2204744 0.9479827 0.2659758 debye
polarizability: 152.682452|-7.0734166|143.5927068|-0.2348228|0.1824991|143.6059487 unknown
InChI: InChI=1S/C12H22O6/c1-11(2)15-7(5-13)9(17-11)10-8(6-14)16-12(3,4)18-10/h7-10,13-14H,5-6H2,1-4H3
charge 0 multiplicity 1
40 atoms
O  1.1017 -1.497972 -0.337977
O  -1.079231 1.399894 -0.451789
O  1.983516 0.290016 0.936881
O  -1.920728 -0.288787 0.970851
O  2.657209 1.730089 -2.502148
O  -2.80353 -2.197708 -2.164091
C  0.781274 -0.248766 -1.063733
C  -0.755429 0.096771 -1.076582
C  1.69836 0.817555 -0.416507
C  -1.680797 -0.91623 -0.35083
C  1.861057 -1.190548 0.911962
C  -1.814804 1.181689 0.835205
C  2.98561 1.073518 -1.226142
C  -3.000856 -1.2038 -1.09795
C  1.056718 -1.624463 2.139998
C  3.235761 -1.867153 0.818392
C  -0.993904 1.714639 2.012918
C  -3.1952 1.842979 0.71462
H  1.088534 -0.419366 -2.111482
H  -1.053514 0.208975 -2.138384
H  1.152197 1.764532 -0.263251
H  -1.160614 -1.867098 -0.156166
H  3.475667 0.131142 -1.518478
H  3.691363 1.676084 -0.61972
H  -3.451475 -0.272753 -1.500631
H  -3.710689 -1.676823 -0.40159
H  0.980222 -2.72535 2.168765
H  1.564397 -1.284515 3.059653
H  0.042527 -1.195445 2.104321
H  3.799483 -1.504381 -0.05618
H  3.821621 -1.660997 1.730954
H  3.105876 -2.958718 0.719388
H  -0.923311 2.814987 1.955421
H  0.020991 1.285725 2.002431
H  -1.488847 1.446252 2.962679
H  -3.76119 1.707474 1.652534
H  -3.773699 1.405134 -0.114787
H  -3.076402 2.923902 0.525322
H  2.299714 2.635798 -2.317485
H  -2.222879 -1.816481 -2.870894
