program: Gaussian 09
title: 000282502
version: EM64L-G09RevD.01
frameworkgroup: C1[X(C13H15BrN2O2)]
method: RPBEPBE
basis: SDD
operation: Freq
keyword: #p
keyword: freq=noraman
keyword: PBEPBE/SDD
title: #p freq=noraman PBEPBE/SDD
converged: YES YES NO NO
title: Mulliken charges:
elementType: Br O O N N C C C C C C C C C C C C C H H H H H H H H H H H H H H H
charge: -0.037386 -0.320823 -0.242354 -0.007500 -0.366902 -0.417284 -0.557938 -0.475232 0.374699 0.116181 0.055292 -0.417951 -0.345502 -0.231672 -0.243003 -0.364126 0.302947 -0.619945 0.212195 0.220479 0.223109 0.226718 0.256167 0.236409 0.234765 0.285972 0.229138 0.232763 0.268699 0.254582 0.336641 0.282737 0.298126
chargesum: 0.00000
title: Mulliken charges with hydrogens summed into heavy atoms:
elementType: Br O O N N C C C C C C C C C C C C C
charge: -0.037386 -0.320823 -0.242354 -0.007500 -0.030260 0.015390 -0.108112 0.017343 0.374699 0.116181 0.055292 -0.183186 -0.059530 -0.002535 -0.010240 0.159154 0.302947 -0.039082
polarizability: 2.71512434e+02 -4.84745291e+00 1.88316782e+02 -1.43893371e+01 1.04927341e+01 9.66400850e+01
1716.lowfreq: -8.6687 -3.5863 -0.6672 -0.0005 -0.0003 0.0006 11.5578 20.8347 32.9854
frequency: 7.3662 20.7147 32.9507 33.7756 62.8079 69.1326 106.0750 132.4805 170.0746 176.9961 204.6759 237.9038 265.4578 304.9980 322.5024 378.7665 416.4149 418.0674 440.6659 465.8268 485.3787 518.0600 545.5696 555.0609 564.3967 581.4161 612.6354 674.2121 689.6048 738.2706 741.1572 772.8831 791.7259 824.4529 845.0749 856.9417 888.9071 900.5660 908.1014 927.3689 968.1551 969.9436 1001.6804 1005.5342 1027.6288 1041.6254 1063.5712 1087.5955 1100.3191 1123.6633 1145.2229 1152.9549 1174.9335 1186.4202 1191.0879 1208.3903 1227.6403 1242.8415 1269.6539 1293.8503 1319.8391 1324.4590 1337.6179 1356.4236 1369.4643 1380.9602 1432.4787 1438.6688 1440.0991 1446.2418 1459.8375 1472.5918 1476.0435 1482.2110 1537.6184 1583.3291 1614.7248 1707.1445 2957.7075 2972.1270 2994.8922 3003.0011 3037.1801 3052.8437 3058.0885 3060.1659 3068.5742 3119.2360 3136.4374 3152.2608 3154.0073 3169.9799 3568.4116
redmass: 6.3459 7.1319 4.8964 5.9095 3.6376 6.4550 3.6639 4.1727 6.0865 3.6780 4.8207 5.5520 3.2178 3.0355 2.8537 3.6637 3.6216 3.0209 3.0517 3.7504 3.7063 3.9741 3.6887 2.9324 1.4038 4.3492 3.1743 5.2778 10.8432 3.4864 2.9162 1.5063 3.3575 2.3878 3.2123 1.8343 1.4057 2.4045 3.4852 2.4616 2.5248 1.3842 1.3413 1.8186 3.4961 2.3027 1.9703 2.0658 3.9987 1.7781 1.1665 1.3881 1.0857 1.8527 1.4452 2.2193 1.3122 1.3481 1.4188 1.1647 2.6184 1.3795 1.6514 1.5529 1.2890 6.4428 1.1030 1.7842 1.0986 1.3811 1.1320 1.1044 1.7481 2.2372 8.0112 6.9507 6.6603 10.2562 1.0664 1.0675 1.0612 1.0595 1.0935 1.0943 1.0691 1.1011 1.0901 1.0869 1.0897 1.1113 1.0949 1.0989 1.0774
irintensity: 0.5386 0.2222 3.1680 5.3302 4.7875 3.8164 2.1150 0.5764 5.6957 0.5586 1.1849 4.0582 0.9789 2.1027 18.9746 7.0590 3.4988 2.3187 6.1710 3.5479 2.0699 4.1082 9.6576 20.3044 113.4542 27.0679 3.2971 15.5547 15.0607 9.4897 13.5142 57.2717 35.8440 10.7427 50.5008 83.0381 1.5334 16.2060 437.5791 3.2019 9.4556 2.5721 0.8056 166.1333 3.8127 1.8404 1.5546 40.0527 169.1037 2.4727 0.7511 96.3739 2.0548 153.0143 15.4362 1.7545 118.4101 6.8985 6.1251 79.5536 46.5991 4.2133 0.9817 5.1384 7.8952 0.3006 7.8581 8.2446 35.8191 15.4910 12.6916 8.7856 464.7527 29.1744 17.3267 3.5670 10.0030 230.0217 27.0323 8.8033 33.6987 37.2661 39.6830 28.8385 11.7772 30.6885 11.3507 7.6830 15.2598 11.4880 22.3579 17.9850 35.8946
temp: 298.150 k
press: 1.00000 atm
elementType: 35 8 8 7 7 6 6 6 6 6 6 6 6 6 6 6 6 6 1 1 1 1 1 1 1 1 1 1 1 1 1 1 1
symmnumber: 1
zpe: 681015.0 jmol-1
zpe.correction: 0.259385 hartree
zpe.thermalcorrener: 0.276707 hartree
zpe.thermalcorrenthalpy: 0.277651 hartree
zpe.thermalcorrgfe: 0.208842 hartree
zpe.sumelectzpe: -776.449891 hartree
zpe.sumelectthermal: -776.432569 hartree
zpe.sumelectthermalent: -776.431625 hartree
zpe.sumelectthermalfe: -776.500434 hartree
dipole: 0.8181 2.4946 1.0455
dipole: 2.8259
quadrupole: -98.2071 -112.7778 -115.6818
quadrupole: 12.5314 -4.8266 3.4342
quadrupole: 10.6818 -3.8889 -6.7929 12.5314 -4.8266 3.4342
hfenergy: -776.709276 hartree
pointgroup: C01 [X(C13H15Br1N2O2)]
dipole: -0.3771381 0.9853806 -0.3505115 debye
polarizability: 271.1298451|11.7798325|190.6155916|-6.265982|-3.7718559|94.7238647 unknown
InChI: InChI=1S/C13H15BrN2O2/c14-8-9-15-13(17)18-16-12-7-3-5-10-4-1-2-6-11(10)12/h1-2,4,6,15H,3,5,7-9H2
charge 0 multiplicity 1
33 atoms
Br 6.327288 1.45419 0.834665
O  1.467804 0.160597 -0.393085
O  2.475987 -2.00973 -0.211284
N  0.16473 -0.51658 -0.204665
N  3.69856 -0.058039 -0.675143
C  -1.780492 2.699036 0.302601
C  -3.104822 2.203523 -0.314134
C  -0.589516 1.891868 -0.254482
C  -3.300665 0.715128 -0.063189
C  -2.17366 -0.157539 0.026204
C  -0.798196 0.389704 -0.141141
C  -4.600391 0.17233 0.083967
C  -2.377418 -1.548659 0.257148
C  -4.79602 -1.206397 0.308369
C  -3.675767 -2.069926 0.395094
C  5.009701 -0.704191 -0.696614
C  2.552136 -0.781261 -0.40498
C  5.823393 -0.504734 0.587619
H  -1.629689 3.772595 0.084479
H  -1.8227 2.588923 1.403261
H  -3.087918 2.399475 -1.40743
H  -3.962916 2.769795 0.092357
H  0.353409 2.163651 0.25168
H  -0.43952 2.135759 -1.327241
H  -5.465878 0.84349 0.023974
H  -1.501913 -2.201565 0.321627
H  -5.810142 -1.605626 0.42192
H  -3.81869 -3.141275 0.57282
H  4.83508 -1.790466 -0.81946
H  5.587989 -0.348204 -1.568124
H  3.63114 0.955971 -0.771275
H  6.784909 -1.039271 0.5514
H  5.254787 -0.769972 1.490863
