program: Gaussian 09
title: 000282496
version: EM64L-G09RevD.01
frameworkgroup: C1[X(C11H7ClF3N3)]
method: RPBEPBE
basis: SDD
operation: Freq
keyword: #p
keyword: freq=noraman
keyword: PBEPBE/SDD
title: #p freq=noraman PBEPBE/SDD
converged: NO YES NO NO
title: Mulliken charges:
elementType: Cl F F F N N N C C C C C C C C C C C H H H H H H H
charge: -0.038847 -0.106566 -0.168464 -0.159424 -0.211879 -0.022661 0.003254 0.336686 -0.426800 0.130554 0.002048 -0.333766 -0.420621 0.271826 -0.305255 -0.101411 -0.209894 -0.139951 0.256340 0.281821 0.273054 0.270143 0.288096 0.267318 0.264400
chargesum: 0.00000
title: Mulliken charges with hydrogens summed into heavy atoms:
elementType: Cl F F F N N N C C C C C C C C C C C
charge: -0.038847 -0.106566 -0.168464 -0.159424 -0.211879 -0.022661 0.003254 0.336686 0.111361 0.130554 0.002048 -0.060712 0.137617 0.271826 -0.037938 -0.101411 0.054505 -0.139951
polarizability: 2.07936138e+02 3.45933761e+00 1.63479189e+02 4.45316578e+00 1.42623671e+01 7.56468168e+01
1716.lowfreq: -7.7553 -3.6483 -0.0020 -0.0003 0.0005 2.5443 33.8906 43.6620 51.7642
frequency: 33.8619 43.6341 51.7584 65.7418 86.7233 114.4639 141.2885 159.9062 206.2003 216.4514 253.5956 261.9170 289.9332 327.1044 372.7984 376.5070 392.7001 395.0511 432.0032 455.7500 481.3494 508.5324 576.4528 595.5602 602.3025 645.8394 666.0791 696.4340 756.6659 764.2277 769.7358 816.6950 825.3038 850.3522 897.4684 940.1504 946.3885 961.7295 1008.5485 1018.7723 1045.1194 1050.6067 1084.6800 1119.1485 1153.8504 1214.7901 1246.6405 1259.4526 1277.6167 1287.5124 1327.2487 1354.4049 1375.8982 1387.2268 1435.5315 1453.7645 1457.2419 1498.1660 1499.1080 1582.6072 1622.6312 2207.0173 3009.5744 3038.8721 3069.8639 3112.8900 3168.6400 3169.9808 3187.1138
redmass: 12.2876 15.9635 10.8306 4.7185 3.3205 12.3534 11.2855 6.9473 5.0179 5.8063 9.6391 9.7500 4.3375 7.6085 3.8922 8.3970 7.0146 13.0272 3.4945 9.7009 7.2027 9.6114 6.9088 5.0447 5.1429 10.2166 8.2952 11.6175 3.8299 4.7801 1.4785 4.1021 1.5293 1.4832 6.0229 10.6154 4.9615 1.3449 5.3047 4.3407 2.1637 2.7257 5.1188 1.8729 1.7760 1.8675 2.6650 1.6437 1.8398 1.3222 1.9445 1.5119 3.0011 5.4788 3.6626 1.4254 2.0898 1.1334 9.0275 8.4900 8.1163 12.4430 1.0594 1.0635 1.1002 1.1038 1.0890 1.0936 1.0980
irintensity: 2.5448 0.0029 0.2193 3.8493 4.5076 1.7570 0.8980 7.5454 3.8125 4.3404 1.5947 0.9568 0.5217 1.4628 1.6270 1.2037 2.0763 16.6647 11.0868 7.3315 3.1728 0.5057 1.3432 6.1081 4.7451 6.5791 9.8574 2.8928 3.8857 24.7949 1.3880 6.8378 45.8716 21.9276 13.5890 224.4775 9.1921 2.1946 219.3123 26.9483 19.5405 117.2755 122.9956 72.1891 34.1263 63.9690 39.8681 8.9083 37.9614 3.3642 18.3499 68.5263 43.9706 78.8484 36.1223 14.4356 29.7570 28.4072 119.8491 53.1873 33.9176 9.0401 2.3241 11.8698 0.3260 1.4939 0.1720 0.5501 1.8770
temp: 298.150 k
press: 1.00000 atm
elementType: 17 9 9 9 7 7 7 6 6 6 6 6 6 6 6 6 6 6 1 1 1 1 1 1 1
symmnumber: 1
zpe: 428880.2 jmol-1
zpe.correction: 0.163352 hartree
zpe.thermalcorrener: 0.179319 hartree
zpe.thermalcorrenthalpy: 0.180263 hartree
zpe.thermalcorrgfe: 0.118020 hartree
zpe.sumelectzpe: -1345.921174 hartree
zpe.sumelectthermal: -1345.905207 hartree
zpe.sumelectthermalent: -1345.904263 hartree
zpe.sumelectthermalfe: -1345.966506 hartree
dipole: -2.7908 -0.9373 -0.2470
dipole: 2.9543
quadrupole: -120.2414 -132.1553 -108.8316
quadrupole: 1.2304 0.8968 0.1490
quadrupole: 0.1680 -11.7459 11.5778 1.2304 0.8968 0.1490
hfenergy: -1346.084526 hartree
pointgroup: C01 [X(C11H7Cl1F3N3)]
dipole: -1.1569705 -0.0542275 -0.0973585 debye
dipolederiv: -0.5154874 0.3011699 0.02108 0.4640086 -0.4649574 -0.0443999 0.0457153 -0.0530699 -0.061762 -0.3960156 0.1730069 0.0153214 0.1697009 -0.8137565 -0.0984146 0.0200577 -0.1069783 -0.2646252 -0.8451105 0.0057596 0.2031217 -0.1688262 -0.468441 0.1649482 0.2400867 0.1629311 -0.4922418 -0.7239475 0.1385578 -0.2269589 0.0021488 -0.3374884 -0.0524641 -0.3140167 0.0163775 -0.6949975 -0.5735294 -0.1310516 -0.019235 -0.4437457 -0.6490787 -0.0670117 -0.1417289 -0.0770901 -0.1696979 -0.2019477 -0.3978359 -0.0403393 -0.0581643 -0.3929454 -0.0165968 -0.0165086 -0.0885626 -0.2215832 -0.2498261 -0.03071 0.0170571 -0.0572352 -0.2593905 0.0236672 -0.0392305 -0.036827 -0.2109506 0.5041308 0.1018702 0.0132536 -0.0700905 -0.1119607 -0.0355429 0.0254463 -0.0276435 0.0793177 0.4545249 0.26347 -0.0373788 0.4035189 0.4844359 -0.025153 -0.029368 -0.0717017 0.2558734 -0.6511611 0.3555062 0.0185647 0.4924597 0.649482 0.1511552 0.056469 0.2015404 -0.0434669 0.0184686 0.0693841 0.0058005 -0.1460105 -0.1221684 -0.017163 -0.021746 -0.0214722 0.0046583 -0.3329119 0.0007011 -0.0033506 0.1278055 -0.0954583 0.0102729 0.0230084 0.0244238 -0.1375554 0.0866774 -0.1196267 -0.0087591 -0.1780341 -0.0133117 -0.0341286 -0.0100857 0.0019357 0.083683 2.3439266 -0.4611346 0.0150077 -0.2558288 1.6592812 -0.0338844 0.0391952 -0.0779328 1.4817566 0.2679504 -0.1342359 0.0184121 0.0318653 0.142884 0.0579956 0.0516125 0.0369364 -0.0953094 0.6945687 -0.3567061 -0.0078047 -0.6945964 0.8335734 0.1225401 -0.0615017 0.1524888 -0.0391278 -0.1351746 0.1539131 0.0388659 0.31721 -0.3994257 -0.0193904 0.0682772 -0.0426303 -0.1248828 0.0293554 0.107346 0.017927 0.1051155 0.1030924 0.0373369 0.1301386 0.1410738 -0.068651 0.0356691 0.0397423 0.0958979 -0.0298599 -0.0143742 -0.0579482 0.0547556 -0.028483 0.0181632 -0.010292 -0.0104814 -0.0458843 0.0158677 0.0643967 0.0574072 -0.0075476 0.0343595 0.0692905 0.0871607 -0.043337 -0.0242823 -0.0308981 -0.0006643 -0.036625 -0.0242651 -0.0482503 0.1649389 0.0001694 0.0174897 -0.0769942 0.0203604 0.0499395 0.0271229 -0.058959 -0.0002643 0.0781688 0.0630972 -0.0125366 0.0500068 0.0244448 0.0585244 -0.0571519 0.0155439 -0.0350146 0.0691955 0.0780824 -0.011645 -0.012165 -0.041977 -0.0034563 -0.0418857 -0.0209699 -0.0397569 0.1559242 -0.0283782 -0.0186161 -0.0271641 0.0007606 0.1012676 -0.014686 -0.0243788 -0.0163894 0.1638812 unknown
polarizability: 206.4336389|-8.7775112|164.8883229|8.1472096|12.8320786|75.7401828 unknown
InChI: InChI=1S/C11H7ClF3N3/c12-7-2-3-8-9(6-7)18(5-1-4-16)10(17-8)11(13,14)15/h2-3,6H,1,5H2
charge 0 multiplicity 1
25 atoms
Cl -4.508353 2.206103 0.214408
F  2.189136 -3.213303 -0.198351
F  2.917117 -1.146361 -0.805936
F  2.663227 -1.659513 1.389633
N  0.341578 -0.018714 0.317398
N  -0.3940 -2.130225 -0.246091
N  3.055017 4.058142 -0.060396
C  -1.049441 0.073193 0.160125
C  1.241632 1.104722 0.62418
C  0.665469 -1.365438 0.051347
C  -1.490941 -1.250413 -0.184291
C  -1.939056 1.161049 0.293727
C  1.620079 1.896944 -0.66496
C  2.071496 -1.866249 0.104842
C  -2.864211 -1.507032 -0.40572
C  -3.291826 0.860227 0.064589
C  -3.767839 -0.436492 -0.279014
C  2.412744 3.093701 -0.342612
H  0.734932 1.76928 1.344792
H  2.150762 0.721164 1.112535
H  -1.622708 2.172904 0.56003
H  0.704643 2.206554 -1.202764
H  2.200007 1.244612 -1.342369
H  -3.206065 -2.512067 -0.666699
H  -4.838001 -0.589185 -0.441403
