program: Gaussian 09
title: 000282563
version: EM64L-G09RevD.01
frameworkgroup: C1[X(C19H17BrN2O8)]
method: RPBEPBE
basis: SDD
operation: Freq
keyword: #p
keyword: freq=noraman
keyword: PBEPBE/SDD
title: #p freq=noraman PBEPBE/SDD
converged: YES YES NO NO
title: Mulliken charges:
elementType: Br O O O O O O O O N N C C C C C C C C C C C C C C C C C C C H H H H H H H H H H H H H H H H H
charge: 0.111793 -0.227921 -0.230261 -0.163729 -0.226572 -0.255444 -0.208956 -0.205009 -0.204602 0.126582 0.016597 -0.278356 -0.390819 -0.503114 0.526501 0.541905 0.355484 0.322069 -0.553157 -0.357087 -0.403025 -0.343946 0.389268 -0.212185 -0.389276 -0.229169 -0.238422 -0.234200 -0.501171 -0.503643 0.317691 0.343720 0.294392 0.288077 0.239150 0.248136 0.239374 0.288635 0.233263 0.236065 0.236093 0.245529 0.256368 0.245639 0.238615 0.270881 0.248239
chargesum: 0.00000
title: Mulliken charges with hydrogens summed into heavy atoms:
elementType: Br O O O O O O O O N N C C C C C C C C C C C C C C C C C C C
charge: 0.111793 -0.227921 -0.230261 -0.163729 -0.226572 -0.255444 -0.208956 -0.205009 -0.204602 0.126582 0.016597 0.039335 -0.047099 -0.503114 0.526501 0.541905 0.355484 0.322069 -0.258765 -0.069010 -0.163875 -0.095811 0.389268 0.027189 -0.100642 0.004094 -0.002357 0.001893 0.246365 0.254092
polarizability: 2.95654390e+02 -1.35377771e+01 2.35145027e+02 -1.01955239e+00 1.80589782e+01 2.52530912e+02
1716.lowfreq: -9.9171 -0.0003 0.0005 0.0008 4.5259 5.8560 12.9408 20.3210 28.7055
frequency: 12.8589 20.2560 28.7006 44.4650 45.4969 53.5458 61.1708 67.7918 75.7347 80.2847 83.0781 95.7100 101.8788 107.3931 110.0312 125.7964 137.6831 148.1808 154.1709 167.6670 176.2996 187.5550 208.2938 216.9383 229.8925 253.6524 261.8107 269.4097 283.2736 292.3993 336.0896 343.3694 368.4917 391.3419 403.5674 427.1984 465.3039 494.9032 502.5396 538.1056 562.9791 567.2442 589.9476 615.1092 632.0687 650.2646 667.3500 688.9313 692.8104 700.3976 703.9449 709.2576 734.3011 742.4481 771.1976 776.9953 818.0961 824.1100 833.7846 852.9508 860.1806 873.0908 890.7779 922.2726 931.5907 943.9665 968.1022 980.7613 990.8483 991.7256 999.1897 1001.2652 1011.7632 1024.3991 1037.7183 1049.5106 1088.5759 1092.5592 1097.2888 1113.9699 1119.5426 1152.6773 1157.0195 1175.8521 1181.2107 1183.3219 1194.0682 1198.0168 1200.8346 1205.4843 1208.6742 1222.8631 1239.9869 1276.7819 1287.5952 1320.0558 1329.2225 1349.2639 1371.8362 1385.8147 1401.0526 1420.1164 1421.3161 1432.1725 1441.1788 1446.5020 1453.0462 1454.6356 1458.6541 1463.9358 1479.6508 1482.9469 1588.2923 1594.1568 1605.0875 1609.1176 1615.7410 1617.3351 3012.2957 3013.0563 3028.0496 3104.2884 3119.1120 3123.5943 3128.0156 3131.4993 3142.3766 3149.2839 3154.0572 3162.2585 3163.5481 3168.7853 3169.5126 3172.6764 3187.6463
redmass: 6.5813 8.9152 7.2565 5.4843 6.8246 5.0336 5.9877 4.4202 1.7289 3.9028 3.4794 1.5735 2.6252 6.3413 3.9822 6.8202 9.4765 7.2638 8.9616 5.4700 5.5650 6.7277 7.1431 6.5063 6.4430 4.7675 6.0610 4.9155 5.8849 5.9645 7.6435 7.9602 8.6111 8.9786 2.7976 3.2851 5.5764 4.6175 7.6317 6.2391 5.5391 6.4574 8.5715 6.3778 6.4490 7.5351 7.8249 6.6925 5.5052 2.4671 2.5291 2.7599 6.6934 7.1718 2.7892 8.4041 3.1766 2.2043 3.4046 1.2544 5.5448 7.3892 5.2227 4.0726 1.4794 1.8123 1.3699 1.3982 6.1948 6.0773 4.6129 1.4603 1.3652 2.7798 3.4939 7.1608 1.6009 1.6608 2.1125 1.2649 1.2674 1.4403 1.4173 1.1264 1.4161 2.1020 1.1903 4.1532 2.8643 5.0781 3.0098 4.1373 1.9009 1.7146 1.6252 1.3443 1.3472 1.2745 10.5899 6.8244 4.8389 1.2688 1.2181 3.4090 2.5499 2.1032 1.0827 1.0496 1.0504 1.0535 2.5880 2.2273 6.5331 6.0513 9.4598 5.9806 7.8598 7.8838 1.0292 1.0287 1.0831 1.0864 1.1053 1.1056 1.0862 1.0876 1.0919 1.0885 1.0963 1.1057 1.1052 1.0925 1.1012 1.0939 1.0967
irintensity: 1.1137 1.1523 0.7534 0.2901 0.1930 2.3317 0.1137 1.6391 1.1100 0.7359 0.2564 0.5218 1.7024 1.0294 0.4258 1.4584 1.4524 4.7865 0.5375 2.5695 3.1262 6.8884 3.9291 2.0164 1.5231 1.7056 0.4215 7.5065 8.6314 7.6843 3.3187 15.8156 14.5050 1.9170 0.0098 0.0178 5.7485 17.6659 5.8097 19.6657 1.6110 19.6472 30.9675 0.5865 6.0867 6.0243 3.2044 12.6024 6.1030 45.1796 52.2950 39.3704 4.1154 11.7849 4.2910 28.6218 8.6195 17.8231 14.2546 0.9611 6.8129 5.6396 1.6562 9.9834 4.5426 8.0261 1.8208 0.0340 2.1349 2.8393 26.5534 4.3666 2.2241 12.3634 4.5484 88.4755 22.0041 10.4921 24.6787 0.0273 0.4382 8.8140 1.9584 3.1028 46.9185 48.5295 6.8897 156.0235 72.7125 260.3477 172.9810 182.3886 22.4763 15.5599 20.6332 15.9683 10.6305 0.2671 101.3586 6.1829 4.3601 35.8615 11.2986 60.2762 26.1488 31.3732 19.6379 14.5714 12.2530 10.6570 31.8235 15.3336 7.6659 6.1029 148.6120 0.7200 77.0403 99.9525 26.1719 25.4675 1.0777 6.0595 15.9034 11.1827 2.7668 0.4104 10.9971 8.4122 19.6296 8.6058 10.5674 6.4949 15.3878 5.2753 2.2438
temp: 298.150 k
press: 1.00000 atm
elementType: 35 8 8 8 8 8 8 8 8 7 7 6 6 6 6 6 6 6 6 6 6 6 6 6 6 6 6 6 6 6 1 1 1 1 1 1 1 1 1 1 1 1 1 1 1 1 1
symmnumber: 1
zpe: 880757.7 jmol-1
zpe.correction: 0.335463 hartree
zpe.thermalcorrener: 0.365023 hartree
zpe.thermalcorrenthalpy: 0.365967 hartree
zpe.thermalcorrgfe: 0.271064 hartree
zpe.sumelectzpe: -1456.613159 hartree
zpe.sumelectthermal: -1456.583599 hartree
zpe.sumelectthermalent: -1456.582654 hartree
zpe.sumelectthermalfe: -1456.677558 hartree
dipole: -1.7593 0.7228 3.6310
dipole: 4.0989
quadrupole: -182.3580 -198.9120 -162.9663
quadrupole: 29.8271 9.8323 -9.0163
quadrupole: -0.9459 -17.4999 18.4458 29.8271 9.8323 -9.0163
hfenergy: -1456.9486216 hartree
pointgroup: C01 [X(C19H17Br1N2O8)]
dipole: -0.8700272 -0.2118528 -1.3411894 debye
polarizability: 299.0501969|1.2696319|234.4662106|0.3417755|18.4602498|249.8139216 unknown
InChI: InChI=1S/C19H17BrN2O8/c1-29-17(23)19(20,18(24)30-2)15(13-9-6-10-14(11-13)21(25)26)16(22(27)28)12-7-4-3-5-8-12/h3-11,15-16H,1-2H3
charge 0 multiplicity 1
47 atoms
Br -1.040039 2.997454 0.481284
O  -3.357038 2.042535 -1.32905
O  -2.439828 1.131118 2.459604
O  -2.640132 -2.853197 0.472283
O  -1.651711 -1.735489 2.193889
O  -2.095748 0.299328 -2.184849
O  -3.867519 0.179009 0.885887
O  5.253853 2.358258 -0.072008
O  4.023603 1.997118 1.813091
N  -1.789218 -2.02548 0.94392
N  4.178718 1.974298 0.531062
C  -0.472302 0.105474 0.304788
C  -0.786607 -1.387818 -0.068083
C  -1.705447 1.085423 0.144917
C  0.792981 0.572252 -0.430967
C  0.438804 -2.299162 -0.058752
C  -2.378371 1.086273 -1.249454
C  -2.803089 0.765607 1.190662
C  1.874185 1.052042 0.341555
C  0.935092 0.516893 -1.842833
C  0.723481 -3.08129 -1.203845
C  1.274912 -2.399185 1.081634
C  3.054801 1.474144 -0.300792
C  2.12724 0.949247 -2.466397
C  3.205734 1.436841 -1.702759
C  1.843102 -3.94209 -1.218203
C  2.390862 -3.261541 1.0673
C  2.68043 -4.0327 -0.083223
C  -4.156151 2.059115 -2.581486
C  -3.364778 0.702223 3.544965
H  -0.25527 0.124865 1.389349
H  -1.30849 -1.452749 -1.033376
H  1.813484 1.115282 1.431736
H  0.110028 0.144138 -2.455908
H  0.067785 -3.018744 -2.08034
H  1.047278 -1.821742 1.985052
H  2.214289 0.901415 -3.556577
H  4.139872 1.776455 -2.157157
H  2.057682 -4.542294 -2.108898
H  3.032465 -3.334731 1.951885
H  3.547795 -4.701731 -0.091794
H  -4.857129 2.89315 -2.447429
H  -4.688591 1.10037 -2.691472
H  -3.49566 2.22331 -3.448695
H  -2.947443 1.154248 4.45434
H  -3.361311 -0.398321 3.600231
H  -4.382406 1.07188 3.339014
