program: Gaussian 09
title: 000287800
version: EM64L-G09RevD.01
frameworkgroup: C1[X(C10H19N3S)]
method: RPBEPBE
basis: SDD
operation: Freq
keyword: #p
keyword: freq=noraman
keyword: PBEPBE/SDD
title: #p freq=noraman PBEPBE/SDD
converged: YES YES NO NO
title: Mulliken charges:
elementType: S N N N C C C C C C C C C C H H H H H H H H H H H H H H H H H H H
charge: -0.106259 -0.135809 -0.061215 -0.063911 -0.029783 -0.441978 -0.399388 -0.370392 -0.418255 -0.364028 -0.186630 -0.341480 -0.619103 -0.659634 0.238434 0.218437 0.218028 0.216220 0.188558 0.215022 0.250896 0.224133 0.230543 0.207808 0.213942 0.258888 0.199201 0.226392 0.191330 0.222738 0.208149 0.254040 0.215107
chargesum: 0.00000
title: Mulliken charges with hydrogens summed into heavy atoms:
elementType: S N N N C C C C C C C C C C
charge: -0.106259 -0.135809 -0.061215 -0.063911 0.208651 -0.005513 0.005389 0.095526 0.036422 0.057722 -0.186630 0.116608 0.021357 0.017663
polarizability: 1.78818246e+02 -2.04265271e+00 1.52155928e+02 6.18934385e+00 -2.50156141e+00 1.02305350e+02
1716.lowfreq: -13.7899 -0.0021 -0.0015 -0.0015 2.4011 9.0241 27.0248 67.8910 88.4867
frequency: 24.4501 67.5456 88.2455 112.9216 145.9027 159.1877 215.6978 217.4236 234.0840 252.7616 304.7011 319.4990 334.0353 349.3983 376.9894 404.2523 433.9648 454.4170 479.7715 512.6705 544.5637 574.2738 614.0260 617.6278 771.8756 779.0371 822.4104 842.1348 887.3180 920.4783 956.9697 963.4100 980.9940 1036.3123 1048.5260 1060.4058 1073.7679 1085.1030 1086.9163 1093.3019 1118.2247 1130.8565 1150.5455 1161.2843 1181.5574 1202.3179 1217.9447 1224.8759 1251.2049 1274.8986 1283.9395 1286.7174 1294.7025 1321.8167 1337.2730 1344.2023 1353.1319 1361.1374 1364.4290 1368.7600 1385.2241 1397.6074 1430.2425 1434.8732 1451.5433 1454.8884 1459.1178 1462.6309 1463.8140 1469.4661 1473.5228 1481.6099 1483.1417 1498.8373 2833.7833 2861.0191 2875.4406 2949.5016 2956.6282 2975.1079 2981.8131 2985.2027 2998.8190 3018.6514 3020.3029 3037.3459 3058.3216 3063.2103 3065.6922 3075.2957 3077.9643 3081.6789 3097.8661
redmass: 3.7933 4.2372 3.0454 2.9533 2.5892 2.9217 2.2990 1.3122 1.1987 1.8034 4.5157 2.1386 3.3666 3.4060 2.3791 2.9463 3.4099 3.3491 2.4848 3.3394 2.7672 3.3054 3.8693 3.3674 2.0186 1.5774 2.6737 2.4145 1.9824 1.6010 2.5382 2.0796 2.2208 2.6581 1.7866 2.0765 2.5372 1.9512 2.0675 2.2361 1.5994 1.8874 2.4023 2.2681 2.0702 1.5434 1.3917 1.9528 1.7882 1.6699 1.7196 1.4787 1.3576 1.3401 1.5031 1.3057 1.5995 1.3705 1.2669 1.4390 1.2291 1.6743 1.1686 1.3167 1.0805 1.1058 1.1546 1.2149 1.1600 1.0531 1.0980 1.0528 1.0674 1.4107 1.0692 1.0601 1.0657 1.0694 1.0832 1.0651 1.0389 1.0624 1.0605 1.0880 1.0743 1.0904 1.0936 1.0974 1.1034 1.0974 1.1009 1.0983 1.1015
irintensity: 0.7500 2.0810 1.7489 0.4976 3.5500 0.9303 2.5291 1.2585 0.7086 0.5993 3.8109 9.2367 3.2258 4.8249 1.2091 3.0960 6.1703 0.1772 4.7207 5.9818 0.7138 2.9603 3.5877 0.9521 8.0979 7.4402 4.5997 5.8513 9.5811 0.8046 3.9377 17.2016 21.1338 3.6887 30.9944 0.4622 15.5632 18.6187 29.8739 7.4073 17.9569 9.0013 27.5278 24.3161 4.7040 10.3855 18.7072 90.6882 36.6877 60.8408 91.7939 21.0772 37.3087 72.1060 76.9152 6.9584 29.4655 2.2057 6.6027 12.3129 24.4934 58.9275 4.8083 55.0243 3.9568 8.0966 72.0990 18.3788 35.3284 16.7007 15.5950 10.7209 9.7386 136.9546 58.7188 71.9782 139.4850 36.7105 45.7907 66.8140 35.3709 64.3716 25.3970 29.8234 62.9996 50.7419 31.5844 3.3660 43.9652 9.9477 32.2794 40.3273 22.0087
temp: 298.150 k
press: 1.00000 atm
elementType: 16 7 7 7 6 6 6 6 6 6 6 6 6 6 1 1 1 1 1 1 1 1 1 1 1 1 1 1 1 1 1 1 1
symmnumber: 1
zpe: 752674.5 jmol-1
zpe.correction: 0.286679 hartree
zpe.thermalcorrener: 0.300961 hartree
zpe.thermalcorrenthalpy: 0.301905 hartree
zpe.thermalcorrgfe: 0.245346 hartree
zpe.sumelectzpe: -953.657252 hartree
zpe.sumelectthermal: -953.642970 hartree
zpe.sumelectthermalent: -953.642026 hartree
zpe.sumelectthermalfe: -953.698585 hartree
dipole: 1.7440 -5.1404 0.1676
dipole: 5.4308
quadrupole: -87.0260 -95.1149 -94.7065
quadrupole: 9.0883 -1.9815 2.1039
quadrupole: 5.2564 -2.8324 -2.4240 9.0883 -1.9815 2.1039
hfenergy: -953.9439306 hartree
pointgroup: C01 [X(C10H19N3S1)]
dipole: 0.6033647 2.0431976 -0.1628745 debye
polarizability: 178.6981626|2.8709023|151.9730317|-5.6272476|-5.2024757|102.6083284 unknown
InChI: InChI=1S/C10H19N3S/c1-3-12-5-4-9-8-11(2)6-7-13(9)10(12)14/h9H,3-8H2,1-2H3
charge 0 multiplicity 1
33 atoms
S  -1.468451 -2.32837 0.436864
N  0.225269 -0.3447 -0.438765
N  3.074641 0.074246 -0.137428
N  -1.935394 0.361345 0.187228
C  0.795403 1.034503 -0.498017
C  -0.206023 2.093004 -0.006222
C  2.104946 1.08671 0.328691
C  1.199708 -1.373041 -0.863283
C  -1.628433 1.678101 -0.40892
C  2.491625 -1.287247 -0.03352
C  -1.034061 -0.685134 0.04888
C  -3.304376 0.141559 0.703334
C  4.378785 0.188869 0.543869
C  -4.332729 -0.126442 -0.416379
H  1.064957 1.229277 -1.557947
H  0.053853 3.075777 -0.439157
H  -0.159166 2.181874 1.095553
H  2.556186 2.091523 0.216929
H  1.839686 0.946676 1.410277
H  1.446633 -1.200651 -1.930544
H  0.723065 -2.359805 -0.745794
H  -2.371731 2.405731 -0.040161
H  -1.716731 1.638073 -1.515751
H  2.264182 -1.562612 1.027056
H  3.223456 -2.016663 -0.427313
H  -3.263655 -0.72618 1.382888
H  -3.589865 1.037898 1.288958
H  5.083131 -0.548824 0.119761
H  4.319491 0.01493 1.647985
H  4.799012 1.197304 0.377973
H  -4.381426 0.711651 -1.136313
H  -4.060149 -1.048112 -0.958489
H  -5.340443 -0.26277 0.017457
