program: Gaussian 09
title: 000287793
version: EM64L-G09RevD.01
frameworkgroup: C1[X(C13H25N3O)]
method: RPBEPBE
basis: SDD
operation: Freq
keyword: #p
keyword: freq=noraman
keyword: PBEPBE/SDD
title: #p freq=noraman PBEPBE/SDD
converged: YES YES NO NO
title: Mulliken charges:
elementType: O N N N C C C C C C C C C C C C C H H H H H H H H H H H H H H H H H H H H H H H H H
charge: -0.335112 -0.221576 -0.078916 -0.155055 -0.050113 -0.370844 -0.430819 -0.380236 -0.356633 -0.407341 0.273046 -0.334783 -0.367560 -0.336945 -0.344301 -0.675270 -0.693323 0.231960 0.179290 0.204430 0.217927 0.206633 0.257168 0.208363 0.208785 0.190891 0.216609 0.219358 0.171041 0.201478 0.208110 0.189532 0.198493 0.259836 0.192574 0.194193 0.246180 0.211221 0.214491 0.216957 0.208162 0.212100
chargesum: 0.00000
title: Mulliken charges with hydrogens summed into heavy atoms:
elementType: O N N N C C C C C C C C C C C C C
charge: -0.335112 -0.221576 -0.078916 -0.155055 0.181847 0.012876 -0.006259 0.085295 0.043043 0.028626 0.273046 0.037735 0.030082 0.121383 0.042466 -0.003378 -0.056103
polarizability: 2.14360302e+02 -1.45645220e+00 1.55656319e+02 -2.64086719e+00 -1.35142261e-01 1.22334234e+02
1716.lowfreq: -0.0008 -0.0007 -0.0005 2.4543 8.3874 18.2803 29.3971 45.5554 52.6319
frequency: 27.1572 44.7386 52.6240 64.8526 72.1626 96.7241 113.1161 124.1382 156.8482 186.8795 201.2962 218.9329 233.6371 238.7161 252.6736 281.9708 330.1227 346.2146 377.4522 384.0803 417.4151 446.0290 464.6090 469.2444 499.4546 555.4147 572.1198 624.5705 671.8685 701.1564 737.9006 776.9231 795.4868 798.4859 846.9615 888.9890 900.7852 911.8959 924.3705 935.2540 960.0971 975.8495 1010.7249 1026.6087 1047.9517 1064.7395 1071.6561 1080.1217 1085.5444 1098.0223 1106.3732 1113.2113 1131.4385 1145.5402 1167.1745 1175.4354 1199.0397 1208.3253 1213.6151 1228.5372 1234.2128 1259.1046 1266.5936 1276.2453 1279.6230 1286.5300 1293.5884 1301.3005 1318.0774 1331.0501 1337.1770 1346.3332 1350.9073 1362.3319 1364.8944 1369.0467 1379.4286 1384.2279 1387.7194 1392.7836 1440.0920 1452.0949 1453.7375 1457.4139 1461.8079 1466.5597 1468.0646 1471.4514 1472.1887 1477.5360 1481.0836 1481.6922 1490.3684 1496.7177 1581.0530 2827.0765 2836.3602 2863.6738 2924.5760 2930.9905 2956.8076 2964.1727 2973.0123 2978.3525 2980.2402 2986.0406 2998.3040 3002.9237 3008.1220 3031.0671 3033.3117 3040.6583 3046.5225 3065.1219 3065.6752 3070.3310 3072.6604 3084.8099 3089.8239 3098.4871
redmass: 3.9225 2.7873 2.4176 1.8929 3.4081 4.2772 2.5807 3.0532 3.3055 2.3997 1.9216 1.4335 3.2142 1.2793 1.8461 2.2762 2.6247 3.4126 2.2727 3.0091 3.2387 3.4580 2.6257 3.5906 3.2059 3.6563 3.1891 2.2647 3.0668 10.8738 1.0774 1.2576 2.6027 1.1888 2.6808 2.0829 1.7905 1.9655 1.4987 1.3596 2.1665 2.4098 2.3501 2.9362 2.8366 2.1018 2.1689 2.1980 2.0269 2.0732 2.3839 1.8866 2.2649 2.3511 2.2615 1.6515 2.3670 1.4322 1.5032 1.7980 1.5561 1.9480 1.3426 1.4246 1.4714 1.1532 1.2709 1.3426 1.4029 1.3365 1.3183 1.4451 1.4853 1.4355 1.3144 1.4151 1.5070 1.2177 1.3489 1.3652 1.7561 1.0867 1.1457 1.1299 1.1042 1.1185 1.0734 1.0452 1.0767 1.0426 1.0701 1.0572 1.0910 1.2395 7.2088 1.0707 1.0698 1.0696 1.0807 1.0720 1.0688 1.0585 1.0373 1.0600 1.0374 1.0655 1.0611 1.0874 1.0982 1.0916 1.0896 1.0905 1.1005 1.1023 1.0984 1.1007 1.0995 1.0961 1.0926 1.1014
irintensity: 0.3891 0.3715 0.4078 0.0408 0.8503 5.6486 0.4381 0.1093 1.5883 1.7077 1.2322 1.5942 1.5769 0.0779 0.2012 4.9444 2.9265 6.1813 7.2868 11.8576 0.3168 4.1918 5.3255 6.3579 3.2256 0.2993 0.4145 3.3334 3.1911 17.7848 8.1195 7.3567 8.1350 0.0909 2.5841 9.9360 17.5311 0.2064 2.3356 1.5767 11.2624 17.2680 10.6440 0.1918 4.6452 27.5806 6.5381 5.5156 43.5369 13.2064 6.2856 9.8757 13.3619 35.7865 7.9493 9.6456 30.1357 20.5851 36.1636 26.5352 25.4363 109.3520 54.1464 44.6608 52.7315 19.3096 3.5610 24.4939 14.2259 13.2095 25.9615 13.7765 7.4921 11.0670 7.4867 16.5666 4.8926 23.7426 8.3783 5.4546 170.2267 6.5580 72.4763 14.5634 32.1722 14.3923 0.7170 16.2426 1.9340 12.6214 2.9579 6.5716 17.9549 117.5378 273.5928 42.0421 89.7039 125.5147 17.3171 87.8852 66.6992 24.9273 31.9037 43.6362 33.2171 56.7989 21.7493 25.0121 2.8848 47.1824 41.3321 31.6790 45.2946 32.0349 34.1907 93.6085 55.9261 36.6879 7.0475 27.4495
temp: 298.150 k
press: 1.00000 atm
elementType: 8 7 7 7 6 6 6 6 6 6 6 6 6 6 6 6 6 1 1 1 1 1 1 1 1 1 1 1 1 1 1 1 1 1 1 1 1 1 1 1 1 1
symmnumber: 1
zpe: 977680.6 jmol-1
zpe.correction: 0.372379 hartree
zpe.thermalcorrener: 0.390645 hartree
zpe.thermalcorrenthalpy: 0.391589 hartree
zpe.thermalcorrgfe: 0.325203 hartree
zpe.sumelectzpe: -748.495646 hartree
zpe.sumelectthermal: -748.477379 hartree
zpe.sumelectthermalent: -748.476435 hartree
zpe.sumelectthermalfe: -748.542822 hartree
dipole: -2.1286 -3.7617 0.0535
dipole: 4.3225
quadrupole: -105.1447 -105.4407 -106.2316
quadrupole: -14.0951 2.4326 1.6203
quadrupole: 0.4610 0.1650 -0.6260 -14.0951 2.4326 1.6203
hfenergy: -748.8680246 hartree
pointgroup: C01 [X(C13H25N3O1)]
dipole: -0.8366264 1.4799758 0.0426506 debye
polarizability: 214.3901197|1.3333589|155.6134783|2.1521643|1.1773368|122.3472571 unknown
InChI: InChI=1S/C13H25N3O/c1-3-5-7-14-9-10-16-12(11-14)6-8-15(4-2)13(16)17/h12H,3-11H2,1-2H3
charge 0 multiplicity 1
42 atoms
O  2.963406 -1.787713 0.175119
N  1.036986 -0.525369 -0.243843
N  -1.844103 -0.602303 -0.19628
N  3.106184 0.546345 0.274226
C  0.26822 0.73904 -0.32429
C  -1.109648 0.557859 0.357986
C  1.051075 1.893006 0.326355
C  0.308872 -1.724286 -0.699601
C  -1.048759 -1.84177 0.00975
C  2.526417 1.847334 -0.101637
C  2.39963 -0.646697 0.071392
C  -3.227532 -0.72363 0.33069
C  -4.186779 0.363873 -0.195885
C  4.551795 0.462814 0.560559
C  -5.643363 0.135969 0.26961
C  5.434947 0.547759 -0.704982
C  -6.610034 1.226171 -0.241032
H  0.078083 0.970041 -1.396701
H  -0.942858 0.445128 1.462505
H  -1.700209 1.477188 0.194754
H  0.99402 1.809609 1.428187
H  0.595024 2.855509 0.030319
H  0.946491 -2.597858 -0.48931
H  0.133721 -1.659572 -1.794488
H  -1.607952 -2.695007 -0.416942
H  -0.878343 -2.046794 1.097412
H  2.611085 2.030446 -1.195968
H  3.100499 2.643147 0.408278
H  -3.24336 -0.720045 1.452879
H  -3.61229 -1.712381 0.011815
H  -4.138876 0.367599 -1.302398
H  -3.859657 1.367914 0.141685
H  4.809464 1.278192 1.265431
H  4.725304 -0.501681 1.065271
H  -5.675743 0.102815 1.378116
H  -5.988723 -0.857943 -0.081607
H  5.207782 -0.294491 -1.381026
H  5.274614 1.494718 -1.253325
H  6.504778 0.492073 -0.430694
H  -7.646461 1.036891 0.09373
H  -6.312782 2.225532 0.129406
H  -6.61312 1.266165 -1.346572
