program: Gaussian 09
title: 000287770
version: EM64L-G09RevD.01
frameworkgroup: C1[X(C14H31N3O)]
method: RPBEPBE
basis: SDD
operation: Freq
keyword: #p
keyword: freq=noraman
keyword: PBEPBE/SDD
title: #p freq=noraman PBEPBE/SDD
converged: YES YES NO NO
title: Mulliken charges:
elementType: O N N N C C C C C C C C C C C C C C H H H H H H H H H H H H H H H H H H H H H H H H H H H H H H H
charge: -0.295362 -0.174779 -0.080120 -0.185532 -0.365429 -0.355734 -0.385291 0.258104 -0.308958 -0.385278 -0.363554 -0.328915 -0.370609 -0.700337 -0.687054 -0.678567 -0.660427 -0.662350 0.275615 0.195932 0.184062 0.214373 0.206685 0.233151 0.202486 0.181418 0.220932 0.218438 0.201385 0.197228 0.266786 0.195005 0.249065 0.208832 0.214938 0.231059 0.209340 0.218263 0.221596 0.216150 0.250945 0.201983 0.214019 0.204447 0.223685 0.213776 0.216951 0.228700 0.212950
chargesum: 0.00000
title: Mulliken charges with hydrogens summed into heavy atoms:
elementType: O N N N C C C C C C C C C C C C C C
charge: -0.295362 -0.174779 -0.080120 -0.185532 0.106118 0.042701 0.054545 0.258104 0.074945 0.054092 0.035059 0.132875 0.087289 -0.044999 -0.031045 -0.011621 -0.018519 -0.003749
polarizability: 2.12286720e+02 -6.58185739e+00 1.76317496e+02 1.79416550e+00 -6.47314075e-01 1.53214696e+02
1716.lowfreq: -7.3519 -0.0007 -0.0005 -0.0002 1.2956 8.0851 17.3747 27.0350 31.0634
frequency: 14.3595 26.8712 30.5281 31.6747 44.1259 54.1305 62.4503 65.2137 71.5428 87.6219 94.4618 135.8263 146.9352 169.5904 184.6444 201.1569 211.0773 223.3191 229.6574 253.2846 268.6161 280.7332 295.3637 313.5217 322.6893 352.0060 360.1985 386.7100 411.3307 458.3629 479.3080 486.9597 523.8560 553.8390 586.8189 684.7084 720.9987 747.8752 758.2111 771.6598 774.4276 784.0950 794.1851 808.1473 848.7082 871.7616 895.2851 898.6921 931.1826 970.5635 978.8170 1016.9540 1029.3663 1049.8963 1058.0926 1065.2318 1066.5497 1073.2730 1075.6447 1083.2903 1087.6308 1098.5455 1109.5597 1121.3843 1142.8656 1197.5710 1203.7477 1206.4206 1219.9654 1242.3451 1258.0448 1265.1768 1280.1922 1287.7568 1294.9767 1314.3056 1325.1948 1334.0802 1338.5190 1340.4252 1347.2309 1350.4516 1367.0113 1369.7241 1377.0454 1379.3618 1383.6408 1384.8854 1387.9993 1393.9565 1403.3502 1453.0192 1458.7679 1462.8997 1464.7738 1467.7909 1468.0138 1468.8011 1468.9319 1473.8180 1476.2362 1476.7810 1478.3908 1481.5135 1482.6255 1488.5857 1489.6670 1490.7916 1498.3868 1566.4396 2847.8750 2868.4270 2963.1413 2975.2170 2975.9678 2976.9980 2978.4527 2981.5862 2982.1991 2983.0393 2992.1500 2999.0817 3010.1622 3015.0607 3023.6294 3029.0165 3039.8697 3060.5279 3068.6717 3069.9891 3070.6457 3075.1672 3077.8942 3078.4374 3078.5636 3080.1597 3083.7050 3089.1778 3089.2270 3096.3475 3097.2148
redmass: 3.4969 3.0221 3.4428 3.1887 2.3289 2.6676 2.4332 2.7945 5.6998 2.6261 2.8590 2.7671 1.7194 1.4353 2.5940 1.4475 1.1311 1.2696 1.3620 1.7355 1.9312 1.5539 2.0788 2.5036 2.7495 2.8116 2.4650 2.4670 2.4232 2.8572 2.8741 2.8288 3.0045 3.0521 4.0555 3.3353 5.2944 2.4890 1.4300 1.1378 1.2055 1.2042 1.3360 1.1969 2.6604 2.1359 1.9960 1.5363 1.9883 2.4442 2.1080 2.3370 2.5739 2.1266 2.1183 2.0705 1.9325 2.4519 1.9599 2.1514 2.2667 1.7558 1.7663 1.8366 2.0308 2.8867 2.3706 2.4458 2.2981 1.5494 1.2266 1.3561 1.2321 1.2706 1.2192 1.2992 1.4018 1.3427 1.2933 1.2551 1.3281 1.3121 1.3731 1.2921 1.2684 1.3092 1.2194 1.2261 1.2447 1.2670 1.9511 1.0734 1.0742 1.0733 1.0906 1.0613 1.0535 1.0517 1.0542 1.0655 1.0488 1.0592 1.0543 1.0540 1.0876 1.0695 1.0858 1.0723 1.0795 6.8211 1.0717 1.0702 1.0654 1.0348 1.0380 1.0387 1.0562 1.0479 1.0566 1.0367 1.0603 1.0664 1.0843 1.0717 1.0987 1.0836 1.1006 1.0970 1.0976 1.0985 1.0989 1.0995 1.0977 1.0971 1.0998 1.0955 1.0998 1.0998 1.1004 1.1005 1.1000
irintensity: 0.1238 0.2187 0.2530 0.5953 0.0935 0.6040 0.3124 0.2610 3.9103 0.3878 0.3096 3.7393 1.2509 1.2182 0.1411 0.1989 0.4795 0.0759 0.4464 1.6530 0.0090 1.8271 2.2863 0.3042 2.0598 9.7116 12.7672 8.7089 2.2467 9.6231 5.2131 11.7402 9.3532 6.2670 8.5930 2.3618 12.2567 7.8613 8.8013 10.8503 7.6765 11.6862 14.4103 5.4335 3.7116 5.9467 5.5178 6.4171 5.2748 9.6538 26.1114 3.6671 21.6678 10.1853 1.5940 29.6617 0.6000 43.9355 14.4727 15.9300 11.6837 14.0028 64.0430 39.6758 99.3973 30.7891 13.6777 26.5104 8.9695 151.3659 4.7756 17.3189 14.0820 20.9540 36.7558 11.4026 17.0865 2.3093 1.2191 14.8555 5.7098 6.3983 5.1643 19.2400 21.5964 2.5225 2.6264 45.2598 24.2303 31.1914 260.9337 1.3415 12.1632 10.5279 12.8409 26.8582 14.2284 2.2640 0.9552 13.7417 7.2526 2.0237 3.5990 9.3042 17.8689 11.4201 25.2702 52.9755 1.9996 208.5694 74.7258 102.6649 24.5693 28.0825 29.3213 51.7272 22.4546 78.3649 26.2582 27.0935 48.8838 40.7086 26.4135 17.2230 27.7304 34.0679 18.8713 14.0578 7.1266 26.2563 47.3277 76.6295 39.3875 73.1780 26.1403 51.5390 49.0540 14.1895 55.6460 48.7366 6.0427
temp: 298.150 k
press: 1.00000 atm
elementType: 8 7 7 7 6 6 6 6 6 6 6 6 6 6 6 6 6 6 1 1 1 1 1 1 1 1 1 1 1 1 1 1 1 1 1 1 1 1 1 1 1 1 1 1 1 1 1 1 1
symmnumber: 1
zpe: 1153580.5 jmol-1
zpe.correction: 0.439376 hartree
zpe.thermalcorrener: 0.463176 hartree
zpe.thermalcorrenthalpy: 0.464120 hartree
zpe.thermalcorrgfe: 0.382661 hartree
zpe.sumelectzpe: -790.040371 hartree
zpe.sumelectthermal: -790.016570 hartree
zpe.sumelectthermalent: -790.015626 hartree
zpe.sumelectthermalfe: -790.097085 hartree
dipole: -0.1026 -0.3503 -4.2301
dipole: 4.2459
quadrupole: -105.4080 -109.9245 -121.9615
quadrupole: -1.6432 -3.7324 -0.6980
quadrupole: 7.0233 2.5068 -9.5302 -1.6432 -3.7324 -0.6980
hfenergy: -790.4797463 hartree
pointgroup: C01 [X(C14H31N3O1)]
dipole: -0.0648654 0.1480226 1.6626149 debye
polarizability: 213.0273599|4.2470678|175.6215187|-0.6524476|-0.553269|153.1700341 unknown
InChI: InChI=1S/C14H31N3O/c1-6-11-17(13-12-15(7-2)8-3)14(18)16(9-4)10-5/h6-13H2,1-5H3
charge 0 multiplicity 1
49 atoms
O  1.4734 0.069408 -1.867675
N  0.472088 -0.536539 0.171033
N  -3.197739 0.332405 -0.362289
N  2.641223 0.47329 0.138233
C  -0.869538 -0.58956 -0.450576
C  -1.803657 0.520173 0.102398
C  0.708568 -1.38461 1.365215
C  1.52519 0.007208 -0.594881
C  -3.970545 -0.604141 0.489008
C  -3.898615 1.584446 -0.73763
C  0.596293 -2.908488 1.085705
C  3.912987 0.663264 -0.599964
C  2.473165 1.283921 1.37102
C  -5.24987 -1.132724 -0.186844
C  -4.24181 2.558524 0.424449
C  1.593437 -3.400017 0.015633
C  5.038249 -0.247492 -0.065383
C  2.127328 2.764242 1.080434
H  -0.759171 -0.468953 -1.539796
H  -1.327685 -1.579908 -0.275138
H  -1.727716 0.544342 1.218079
H  -1.430744 1.496652 -0.259612
H  -0.003267 -1.10295 2.16872
H  1.729273 -1.186833 1.731483
H  -3.31112 -1.465269 0.71033
H  -4.233165 -0.153972 1.480984
H  -3.261319 2.108185 -1.475183
H  -4.828345 1.315127 -1.272416
H  0.778323 -3.432287 2.046355
H  -0.436134 -3.170831 0.783196
H  3.707933 0.45067 -1.662264
H  4.224905 1.725427 -0.539722
H  1.675178 0.853381 1.995922
H  3.41209 1.220069 1.953967
H  -5.998169 -0.334881 -0.343707
H  -5.005587 -1.573766 -1.169363
H  -5.720972 -1.90998 0.442938
H  -4.925484 2.094146 1.158884
H  -3.330239 2.880709 0.961327
H  -4.739008 3.463758 0.028156
H  1.42276 -2.888308 -0.948335
H  2.637253 -3.197408 0.323124
H  1.49361 -4.487802 -0.15214
H  5.242979 -0.059652 1.005393
H  4.760695 -1.310404 -0.18048
H  5.975815 -0.070894 -0.625364
H  2.903627 3.252937 0.465105
H  1.167059 2.835573 0.538866
H  2.035768 3.330608 2.026306
