program: Gaussian 09
title: 000287799
version: EM64L-G09RevD.01
frameworkgroup: C1[X(C10H19N5O)]
method: RPBEPBE
basis: SDD
operation: Freq
keyword: #p
keyword: freq=noraman
keyword: PBEPBE/SDD
title: #p freq=noraman PBEPBE/SDD
converged: YES YES NO NO
title: Mulliken charges:
elementType: O N N N N N C C C C C C C C C C H H H H H H H H H H H H H H H H H H H
charge: -0.344394 -0.220449 -0.132897 -0.172070 -0.675795 -0.443672 -0.009809 -0.443249 -0.439120 -0.399816 -0.389377 -0.395028 0.282981 -0.332821 0.248102 -0.674305 0.236525 0.217481 0.223473 0.295247 0.211915 0.275691 0.219310 0.222664 0.215580 0.205568 0.231816 0.267490 0.198778 0.214307 0.233458 0.217355 0.318448 0.322339 0.214274
chargesum: 0.00000
title: Mulliken charges with hydrogens summed into heavy atoms:
elementType: O N N N N N C C C C C C C C C C
charge: -0.344394 -0.220449 -0.132897 -0.172070 -0.035008 -0.229398 0.226716 -0.002295 0.068042 0.095184 0.048867 0.042356 0.282981 0.133447 0.248102 -0.009185
polarizability: 1.83866562e+02 -2.64512896e+00 1.46185787e+02 4.70521894e+00 -1.07915646e-02 1.03593635e+02
1716.lowfreq: -5.6156 -3.0951 -0.0001 0.0009 0.0009 15.8112 18.9088 41.7042 54.5118
frequency: 18.2553 41.3145 54.3227 74.3588 91.3635 144.9428 152.2188 181.5552 203.7529 215.8247 249.1514 277.0839 285.4007 318.4410 324.1220 346.4938 363.0583 384.6703 443.5480 449.9577 476.5252 507.2201 541.6962 562.8553 568.8199 621.6977 662.1913 669.5905 684.0509 699.5773 753.9803 783.1675 840.7587 888.1128 910.3282 925.2421 958.6926 983.3791 1007.4650 1026.3496 1043.8589 1050.9601 1066.2580 1081.0563 1088.9282 1100.4203 1117.9736 1135.6842 1164.0544 1190.5320 1194.3662 1212.0989 1227.8092 1232.0388 1261.9207 1264.6006 1280.5914 1297.0954 1317.8144 1327.9399 1332.9139 1347.6249 1358.6943 1363.4259 1366.5630 1377.4571 1385.7883 1430.8158 1441.5009 1455.9270 1464.8334 1472.3298 1475.0793 1480.5108 1486.8401 1494.2958 1498.8485 1577.6752 1608.1578 1635.8948 2923.1508 2927.9438 2938.8857 2950.7488 2968.9224 2969.5326 2978.3260 2980.9241 2993.9712 3009.9445 3063.9389 3064.7926 3071.7592 3077.5524 3082.9125 3093.8610 3407.8763 3559.4226 3705.4215
redmass: 4.3238 3.5249 2.5406 4.2326 4.2757 3.9959 3.8436 2.4916 2.3106 1.5119 2.9062 2.1426 3.0700 1.2058 2.4282 1.1435 3.3902 2.8898 3.9373 2.7674 3.2934 3.3842 3.4622 4.0233 2.7124 2.3461 2.6594 2.2557 2.1603 9.8796 2.9900 1.2079 2.4498 2.0005 2.0156 1.6306 2.0604 2.0198 2.4018 2.4707 2.1968 1.3444 2.1218 2.0366 1.9518 2.2879 1.7383 2.1511 2.5783 1.5836 1.6829 1.3090 2.2832 3.2921 1.4845 1.4688 1.9251 1.3536 1.4856 1.4265 1.3796 1.2988 1.4115 1.3496 1.4081 1.8355 1.2199 4.8957 2.2187 1.1025 1.0942 1.0469 1.0946 1.0599 1.0887 1.0955 1.2061 7.3279 2.1036 1.7163 1.0639 1.0749 1.0658 1.0775 1.0764 1.0683 1.0877 1.0364 1.0796 1.0772 1.0969 1.0971 1.1023 1.0923 1.0961 1.1002 1.0770 1.0456 1.1033
irintensity: 2.5165 6.2899 2.0424 11.7492 5.8257 0.6785 0.8343 4.7196 2.7440 4.2401 1.1852 3.0474 0.9117 101.6069 11.2422 179.0323 18.5368 3.8530 3.3641 16.4587 6.2148 8.6556 11.1017 12.2587 11.2699 0.3735 18.1870 9.8859 79.5901 16.2601 7.1469 9.1268 0.4503 10.6512 0.4252 1.6832 24.3757 9.5824 12.3883 93.8927 7.8901 153.2411 33.5053 20.9570 2.3738 4.5046 10.8891 34.1947 15.3357 3.3408 8.9722 100.3223 21.2356 2.2868 26.5240 112.9403 34.5518 78.5867 43.8952 39.1200 25.6112 36.3086 28.1185 6.5728 5.4016 12.4121 16.2066 257.1244 193.7104 9.5828 42.9009 14.7326 39.7028 7.1736 19.0903 25.3797 90.6225 288.4623 299.3533 204.0299 60.6933 25.1194 70.2941 4.2920 66.8391 40.3263 128.4556 30.0573 12.3950 63.5015 16.1660 18.3789 31.3388 8.6802 45.1863 25.1408 16.2396 15.1350 28.8815
temp: 298.150 k
press: 1.00000 atm
elementType: 8 7 7 7 7 7 6 6 6 6 6 6 6 6 6 6 1 1 1 1 1 1 1 1 1 1 1 1 1 1 1 1 1 1 1
symmnumber: 1
zpe: 784586.4 jmol-1
zpe.correction: 0.298833 hartree
zpe.thermalcorrener: 0.315203 hartree
zpe.thermalcorrenthalpy: 0.316147 hartree
zpe.thermalcorrgfe: 0.254079 hartree
zpe.sumelectzpe: -740.193763 hartree
zpe.sumelectthermal: -740.177393 hartree
zpe.sumelectthermalent: -740.176449 hartree
zpe.sumelectthermalfe: -740.238517 hartree
dipole: 1.6913 -0.8174 1.4295
dipole: 2.3605
quadrupole: -84.9637 -101.2511 -95.7378
quadrupole: 22.4633 6.3667 2.6840
quadrupole: 9.0205 -7.2669 -1.7536 22.4633 6.3667 2.6840
hfenergy: -740.4925961 hartree
pointgroup: C01 [X(C10H19N5O1)]
dipole: 0.6574648 -0.2650343 0.5999564 debye
polarizability: 183.6985465|-1.6892289|145.8367008|6.4842542|-3.5190259|104.1107371 unknown
InChI: InChI=1S/C10H19N5O/c1-2-13-4-3-8-7-14(9(11)12)5-6-15(8)10(13)16/h8,11H,2-7,12H2,1H3
charge 0 multiplicity 1
35 atoms
O  -2.203508 1.990822 -0.528248
N  -0.398996 0.521803 -0.324888
N  2.442174 0.147845 -0.088523
N  -2.634629 -0.267022 -0.062466
N  4.360564 0.863189 1.096857
N  3.996482 -1.484397 0.600829
C  0.163215 -0.819655 -0.009293
C  -0.807057 -1.893977 -0.526701
C  1.574773 -0.923544 -0.616141
C  0.534433 1.581029 -0.749155
C  -2.187409 -1.664238 0.112616
C  1.855872 1.50047 0.034375
C  -1.769828 0.808277 -0.311768
C  -4.079332 0.009508 0.063412
C  3.637011 -0.211857 0.552193
C  -4.60072 -0.103241 1.513351
H  0.260792 -0.933203 1.093435
H  -0.438951 -2.90079 -0.25852
H  -0.877795 -1.831783 -1.629006
H  2.052851 -1.87753 -0.336397
H  1.509709 -0.875669 -1.722341
H  0.039921 2.550849 -0.575585
H  0.745421 1.508176 -1.836567
H  -2.942323 -2.327824 -0.35401
H  -2.144858 -1.931126 1.190603
H  2.536412 2.270051 -0.389156
H  1.665809 1.758427 1.099295
H  -4.238831 1.031489 -0.317595
H  -4.630712 -0.695007 -0.592979
H  -4.447464 -1.115952 1.930011
H  -4.086609 0.624039 2.165972
H  -5.684762 0.112607 1.544081
H  5.232289 0.66814 1.578933
H  4.075376 1.833442 0.997349
H  4.909076 -1.638745 1.062524
