program: Gaussian 09
title: 000287791
version: EM64L-G09RevD.01
frameworkgroup: C1[X(C21H16O3)]
method: RPBEPBE
basis: SDD
operation: Freq
keyword: #pfreq=noraman
keyword: PBEPBE/SDD
title: #p freq=noraman PBEPBE/SDD
converged: YES YES NO NO
title: Mulliken charges:
elementType: O O O C C C C C C C C C C C C C C C C C C C C C H H H H H H H H H H H H H H H H
charge: -0.287422 -0.433205 -0.264329 0.118978 0.122513 0.093360 0.217448 0.311816 0.298804 -0.353599 -0.504399 -0.381673 -0.417430 -0.414381 0.324681 -0.376222 -0.378757 -0.355975 -0.370871 0.310620 -0.233888 -0.239617 -0.250866 -0.537420 0.254783 0.275615 0.262059 0.251060 0.216581 0.261616 0.258422 0.253691 0.240607 0.226615 0.228298 0.229001 0.354081 0.221084 0.221518 0.246803
chargesum: 0.00000
title: Mulliken charges with hydrogens summed into heavy atoms:
elementType: O O O C C C C C C C C C C C C C C C C C C C C C
charge: -0.287422 -0.079125 -0.264329 0.118978 0.122513 0.093360 0.217448 0.311816 0.298804 -0.098816 -0.228783 -0.119614 -0.166370 -0.197799 0.324681 -0.114607 -0.120336 -0.102284 -0.130264 0.310620 -0.007273 -0.011319 -0.021865 0.151985
polarizability: 3.31575347e+02 -1.85554881e+01 3.50432702e+02 7.46067632e+00 1.30702523e+01 1.21618403e+02
1716.lowfreq: -1.7408 -0.0009 -0.0001 0.0005 2.4502 5.3754 31.4669 34.3442 48.7149
frequency: 31.4542 34.3389 48.7124 57.5703 72.8530 87.2115 102.8995 136.8954 171.5777 176.8741 208.7564 231.9466 258.4706 267.5926 281.3222 296.7882 328.3985 339.5582 342.1436 397.9837 403.3417 414.9833 428.0843 439.8445 459.6443 497.7308 524.4129 528.3390 574.4576 582.4749 612.9819 614.8191 623.5827 642.9472 671.2001 681.3182 698.4695 727.9192 744.2331 752.5518 772.9653 774.4647 794.1390 816.4298 835.1567 853.5078 854.5000 860.2958 918.6029 926.4834 928.8294 945.3460 951.2635 971.5867 983.1426 987.3092 987.5636 997.2842 1004.4398 1011.1651 1038.1160 1083.8981 1097.0240 1111.2014 1112.8980 1135.2544 1156.7652 1168.8674 1171.3637 1174.3474 1179.4554 1195.7040 1212.1548 1230.1525 1269.6516 1287.7938 1302.1226 1324.7301 1350.7783 1372.0744 1380.2640 1407.9322 1420.6264 1431.9319 1437.2934 1442.8195 1467.1967 1472.2704 1476.4775 1496.9639 1507.3938 1568.4145 1575.9890 1588.0884 1598.0538 1614.1032 1623.2660 1637.3964 2959.0683 3046.7405 3118.5960 3125.9171 3126.6529 3133.6891 3137.4387 3142.5677 3155.2791 3160.5560 3162.3602 3167.8541 3169.2562 3174.4754 3191.2545 3585.3312
redmass: 3.6122 4.9297 5.3504 4.8201 4.8214 4.2652 4.1455 5.8607 4.0364 4.6026 4.5008 1.3813 3.2369 6.1585 6.0391 6.0314 5.5082 1.4045 2.6845 5.0847 2.8618 3.0280 4.3839 3.4055 4.3065 4.6281 4.0397 3.8322 5.8029 5.9759 4.5763 5.0362 6.5209 6.2480 5.1164 6.3006 1.8152 4.2289 4.0625 7.2957 5.8628 1.9813 1.5356 1.3882 1.6945 1.4339 1.3117 3.7087 4.2222 1.3405 1.4668 1.7503 2.7950 1.3483 1.3756 6.1388 8.6682 1.3138 2.5484 5.5960 2.2530 1.8355 1.8315 1.3662 1.2626 1.5089 1.3409 1.8086 1.8487 1.1540 1.3991 1.1320 1.9997 2.9158 2.5080 2.3897 1.3654 1.3973 4.4559 4.4002 6.1466 3.8748 3.7467 2.7274 1.2567 3.3365 1.0501 1.1105 2.1331 3.1823 3.1494 7.3464 6.2286 8.1645 7.7275 6.1692 6.5531 7.7165 1.0330 1.1040 1.0891 1.0991 1.0849 1.0888 1.0894 1.0887 1.0945 1.0947 1.0948 1.0948 1.0964 1.0990 1.0938 1.0661
irintensity: 0.4381 0.4051 0.3100 1.8655 0.7643 1.9481 2.5900 1.3876 1.9869 1.5709 1.9783 0.6081 1.6255 1.0672 0.9701 2.4628 2.2411 103.9980 37.8405 6.2762 0.2743 0.6466 4.1482 6.1846 1.6015 1.7137 15.3869 7.6828 13.8244 21.5344 12.5758 9.6739 2.3851 7.2189 0.7055 4.4353 49.2970 1.3487 2.5696 9.7284 1.0524 63.4466 31.3749 16.7842 31.1265 20.9372 15.2261 39.4752 31.5955 0.7468 3.4889 25.5265 49.2457 0.7700 1.7453 0.5370 39.7184 0.5893 4.3379 54.4329 20.2703 43.2638 164.1588 10.2393 0.6859 27.2975 0.2450 87.2480 6.1780 15.0291 56.8736 0.5563 11.5782 195.4345 80.7239 4.4670 0.7951 4.1249 26.8814 19.0483 2.8131 138.2390 22.7888 10.1244 5.3703 1.6117 13.7020 54.6970 13.2405 33.8969 116.8610 1.4841 15.3906 15.5129 38.5725 27.0873 51.1313 98.0499 77.0872 46.6773 24.1748 30.0367 1.6997 8.2433 12.3693 10.7571 35.9222 2.9547 19.6513 12.3082 5.9949 11.6780 1.3886 70.2262
temp: 298.150 k
press: 1.00000 atm
elementType: 8 8 8 6 6 6 6 6 6 6 6 6 6 6 6 6 6 6 6 6 6 6 6 6 1 1 1 1 1 1 1 1 1 1 1 1 1 1 1 1
symmnumber: 1
zpe: 809567.0 jmol-1
zpe.correction: 0.308348 hartree
zpe.thermalcorrener: 0.328204 hartree
zpe.thermalcorrenthalpy: 0.329148 hartree
zpe.thermalcorrgfe: 0.259071 hartree
zpe.sumelectzpe: -1033.841801 hartree
zpe.sumelectthermal: -1033.821945 hartree
zpe.sumelectthermalent: -1033.821001 hartree
zpe.sumelectthermalfe: -1033.891078 hartree
dipole: -2.4273 -3.1811 -1.0009
dipole: 4.1247
quadrupole: -130.7962 -108.8920 -142.4183
quadrupole: 0.7295 8.5857 6.3501
quadrupole: -3.4274 18.4769 -15.0495 0.7295 8.5857 6.3501
hfenergy: -1034.150149 hartree
pointgroup: C01 [X(C21H16O3)]
dipole: -0.615538 -1.3612993 -0.6335375 debye
polarizability: 340.4961054|-23.0721911|331.6439876|9.399029|45.9488498|131.4863587 unknown
InChI: InChI=1S/C21H16O3/c1-23-17-10-7-14(8-11-17)20-18-12-9-16(22)13-19(18)24-21(20)15-5-3-2-4-6-15/h2-13,22H,1H3
charge 0 multiplicity 1
40 atoms
O  2.061318 1.497236 0.286381
O  5.828124 -1.596924 0.003984
O  -4.636563 -2.851788 -0.17104
C  0.384339 -0.087057 -0.00559
C  1.682087 -0.756196 -0.062595
C  0.643465 1.272834 0.193523
C  2.675196 0.247476 0.1232
C  -0.919997 -0.785008 -0.084087
C  -0.16401 2.491847 0.287173
C  2.105585 -2.100019 -0.209697
C  4.052608 0.006397 0.150516
C  -1.936272 -0.580803 0.893633
C  -1.172245 -1.728157 -1.113732
C  3.48557 -2.384226 -0.187716
C  4.443283 -1.340692 -0.015497
C  0.401579 3.671864 0.852936
C  -1.501218 2.544801 -0.202247
C  -3.153667 -1.278189 0.835749
C  -2.392565 -2.436093 -1.188788
C  -3.389113 -2.210222 -0.207567
C  -0.353049 4.858948 0.940824
C  -2.250391 3.734649 -0.109124
C  -1.6848 4.897892 0.465351
C  -4.927087 -3.824712 -1.226777
H  1.378052 -2.908882 -0.325158
H  4.796019 0.793146 0.29248
H  -1.760031 0.126527 1.711065
H  -0.413781 -1.891337 -1.887852
H  3.830065 -3.420529 -0.299997
H  1.432957 3.644326 1.216326
H  -1.946815 1.660396 -0.666054
H  -3.932679 -1.12525 1.588835
H  -2.551504 -3.145109 -2.006892
H  0.098173 5.755238 1.381047
H  -3.276017 3.756412 -0.494122
H  -2.27085 5.820881 0.535401
H  6.005735 -2.562793 -0.114395
H  -4.204792 -4.664259 -1.211336
H  -4.920052 -3.348363 -2.226657
H  -5.936149 -4.199663 -1.001803
