program: Gaussian 09
title: 000287767
version: EM64L-G09RevD.01
frameworkgroup: C1[X(C15H13FN2O)]
method: RPBEPBE
basis: SDD
operation: Freq
keyword: #p
keyword: freq=noraman
keyword: PBEPBE/SDD
title: #p freq=noraman PBEPBE/SDD
converged: YES YES NO NO
title: Mulliken charges:
elementType: F O N N C C C C C C C C C C C C C C C H H H H H H H H H H H H H
charge: -0.200349 -0.237949 -0.213570 -0.389747 0.180772 -0.163261 0.304160 0.035415 0.133667 -0.828099 -0.144405 -0.323364 -0.338260 -0.305544 -0.271048 -0.160765 -0.371058 -0.370479 0.324486 0.314138 0.223995 0.291229 0.239723 0.271660 0.261121 0.276194 0.226779 0.236043 0.238946 0.258484 0.260074 0.241012
chargesum: 0.00000
title: Mulliken charges with hydrogens summed into heavy atoms:
elementType: F O N N C C C C C C C C C C C C C C C
charge: -0.200349 -0.237949 -0.213570 -0.148735 0.180772 0.150877 0.304160 0.035415 0.133667 -0.073152 0.127255 -0.062244 -0.062066 -0.078765 -0.035004 0.078181 -0.112574 -0.110405 0.324486
polarizability: 2.76545322e+02 1.63173072e+01 1.94225890e+02 2.50226483e+01 -7.89562234e+00 1.24303159e+02
1716.lowfreq: -3.9856 -0.0002 0.0004 0.0007 5.6671 11.4135 25.9556 40.7211 50.3871
frequency: 25.9178 40.6946 50.3777 69.8310 83.5939 108.5677 133.3962 178.6826 197.5333 225.8098 269.0509 286.9658 304.9144 336.2790 367.4154 378.6100 406.3728 416.3560 461.0445 489.4390 492.9103 514.1778 524.5042 554.0196 577.0289 611.0665 626.6582 686.6978 703.9506 718.0784 735.2503 754.5858 769.8424 791.9573 806.4778 821.6223 830.5073 848.9034 855.6147 898.5412 921.0799 934.9998 960.8084 973.3112 975.9659 999.6294 1004.3225 1018.4412 1039.0298 1042.5062 1106.1044 1107.4042 1156.1181 1159.6423 1165.8910 1201.1474 1217.6821 1269.8781 1291.6409 1301.9469 1303.9839 1369.6917 1372.9854 1389.0056 1398.7158 1406.6324 1446.2695 1460.0413 1485.8824 1488.6729 1523.5352 1537.4690 1575.0945 1593.0638 1606.2291 1619.7439 1644.9111 2971.2636 3058.1973 3097.1092 3140.2528 3148.3280 3156.5484 3160.4018 3162.6130 3178.0907 3181.6185 3184.3029 3219.5596 3400.3825
redmass: 5.7045 6.5013 4.0266 3.8696 5.5805 6.0948 5.1278 5.2878 6.2948 1.2706 4.0804 4.6069 5.4086 4.6553 4.3496 5.6255 3.8005 3.0206 4.6498 3.1431 3.3165 3.0067 4.3946 4.9107 6.3232 6.5645 6.9145 3.9278 3.0241 2.5328 1.7522 3.8741 1.2501 5.9939 4.5911 1.2575 1.4667 1.7132 5.2593 1.5276 4.2390 1.3152 1.3626 1.3690 1.3095 2.3978 2.5975 1.7865 1.5183 1.7326 1.3045 1.9659 1.5088 2.5578 1.1179 2.2486 2.0996 2.6026 1.2670 1.8414 3.8350 1.7918 4.2027 1.3119 1.5290 4.0910 2.1649 1.0634 1.1107 2.5935 7.9506 6.5292 6.4142 7.7481 6.4578 6.2712 6.2093 1.0409 1.0916 1.0997 1.0866 1.0902 1.0886 1.0888 1.0966 1.0965 1.0976 1.0925 1.0972 1.0766
irintensity: 1.7260 0.8390 0.0977 1.0153 2.0833 3.1994 3.2413 1.1242 1.9850 0.6114 3.2874 0.1380 1.6611 3.5505 5.7966 1.9582 10.8793 0.0279 2.5321 32.6593 8.6684 1.2719 0.7218 7.4935 43.3973 9.8950 0.8858 32.1687 0.6188 2.2562 3.8165 28.4126 136.9991 19.1016 21.8444 3.8989 21.5693 47.9580 25.5142 26.3554 13.4493 2.1770 2.7495 2.9584 0.4788 43.7017 40.1211 55.4629 15.6562 87.7627 12.0150 27.9042 99.0589 1.9339 8.4000 37.4513 91.1330 90.6433 3.2512 37.1302 463.8897 2.9109 6.4862 42.6817 55.8249 7.9375 31.2189 22.7535 12.8415 41.6462 201.6371 50.5246 176.5574 21.8980 125.7366 126.0840 89.4808 26.4056 17.6352 4.4761 6.3107 14.2980 5.7955 0.3735 20.8907 3.5653 3.7868 2.8025 5.4079 9.5920
temp: 298.150 k
press: 1.00000 atm
elementType: 9 8 7 7 6 6 6 6 6 6 6 6 6 6 6 6 6 6 6 1 1 1 1 1 1 1 1 1 1 1 1 1
symmnumber: 1
zpe: 640489.0 jmol-1
zpe.correction: 0.243949 hartree
zpe.thermalcorrener: 0.260505 hartree
zpe.thermalcorrenthalpy: 0.261449 hartree
zpe.thermalcorrgfe: 0.198377 hartree
zpe.sumelectzpe: -862.591283 hartree
zpe.sumelectthermal: -862.574728 hartree
zpe.sumelectthermalent: -862.573784 hartree
zpe.sumelectthermalfe: -862.636856 hartree
dipole: -5.1124 -1.5840 -2.0327
dipole: 5.7252
quadrupole: -98.5022 -116.1762 -108.1029
quadrupole: 3.7254 6.6925 -4.1737
quadrupole: 9.0915 -8.5824 -0.5091 3.7254 6.6925 -4.1737
hfenergy: -862.8352326 hartree
pointgroup: C01 [X(C15H13F1N2O1)]
dipole: -1.963986 1.0806026 0.2205884 debye
polarizability: 271.9932438|-38.253222|142.1210833|-14.9770943|-25.1120913|180.960044 unknown
InChI: InChI=1S/C15H13FN2O/c1-11(10-18-9-3-2-4-14(18)17)15(19)12-5-7-13(16)8-6-12/h2-10,17H,1H3
charge 0 multiplicity 1
32 atoms
F  4.878023 1.567353 -2.156755
O  1.674321 -2.130866 1.927116
N  -2.239666 0.208016 0.221012
N  -2.033424 -0.131038 -2.111973
C  -0.263512 -0.820648 1.376959
C  -0.884881 -0.205983 0.313208
C  2.098639 -0.414191 0.307481
C  1.189096 -1.170903 1.240303
C  -2.800733 0.289008 -1.123641
C  -0.941885 -1.365229 2.620358
C  -2.976591 0.620368 1.335853
C  1.960444 0.97479 0.037936
C  3.203185 -1.117712 -0.247683
C  -4.165673 0.810424 -1.194203
C  -4.267246 1.094166 1.232072
C  -4.879066 1.181227 -0.071289
C  2.891652 1.647823 -0.7817
C  4.13198 -0.468404 -1.081966
C  3.950491 0.905322 -1.330448
H  -0.367693 -0.065224 -0.641036
H  -0.922342 -0.643856 3.461313
H  -0.37518 -2.252171 2.95052
H  -1.989747 -1.65579 2.434524
H  -2.44853 0.586283 2.287874
H  1.143021 1.542381 0.492268
H  3.317826 -2.17861 -0.0057
H  -4.606646 0.883691 -2.194004
H  -4.794634 1.415784 2.132427
H  -5.903664 1.555862 -0.167564
H  2.807189 2.718145 -0.989655
H  4.977073 -0.999297 -1.529164
H  -2.484925 -0.019723 -3.03714
