program: Gaussian 09
title: 000287756
version: EM64L-G09RevD.01
frameworkgroup: C1[X(C15H12N4O2)]
method: RPBEPBE
basis: SDD
operation: Freq
keyword: #p
keyword: freq=noraman
keyword: PBEPBE/SDD
title: #p freq=noraman PBEPBE/SDD
converged: YES YES NO NO
title: Mulliken charges:
elementType: O O N N N N C C C C C C C C C C C C C C C H H H H H H H H H H H H
charge: -0.295587 -0.263691 -0.156266 -0.373038 -0.035037 -0.476554 0.162280 0.058099 0.205432 -0.322114 -0.325135 -0.195933 -0.236290 -0.203049 0.481061 0.286804 -0.442269 -0.340304 -0.195691 -0.211591 -0.254540 0.269717 0.263635 0.282875 0.325356 0.236127 0.236485 0.307691 0.219202 0.304156 0.228417 0.228693 0.231059
chargesum: 0.00000
title: Mulliken charges with hydrogens summed into heavy atoms:
elementType: O O N N N N C C C C C C C C C C C C C C C
charge: -0.295587 -0.263691 -0.156266 -0.047682 -0.035037 -0.168864 0.162280 0.058099 0.205432 -0.052397 -0.061500 0.086943 -0.000163 0.033436 0.481061 0.286804 -0.223067 -0.036148 0.032726 0.017103 -0.023481
polarizability: 3.62417292e+02 9.64442039e+00 1.82920815e+02 -1.38022968e+01 -4.20281683e+00 1.01371683e+02
1716.lowfreq: -5.7324 0.0004 0.0006 0.0010 1.7050 5.7089 15.4738 22.8297 42.7830
frequency: 15.0863 22.6694 42.7699 70.3457 76.1289 105.8844 131.8473 178.3208 202.7767 234.1724 240.4053 266.2608 318.7286 328.2881 346.6652 407.0223 424.7159 454.4451 470.8661 491.8702 495.0035 524.4788 544.6126 579.0070 591.9022 602.1882 614.4415 619.8513 675.0490 687.9594 695.6979 698.9529 760.1443 766.5752 780.9346 785.4981 807.8925 840.1414 844.6027 853.9883 864.7756 897.5483 915.5483 955.6136 972.1482 979.4316 984.2863 998.4328 1004.0489 1004.6470 1025.5007 1033.0154 1091.0184 1097.2162 1141.9172 1167.9101 1173.3690 1175.9088 1190.7236 1219.4371 1224.3755 1258.5769 1283.1974 1299.0569 1324.6752 1367.8308 1385.7494 1399.6514 1432.4342 1447.7172 1454.6326 1485.1648 1490.2093 1520.3797 1543.5007 1557.9585 1603.8789 1606.4892 1615.5286 1618.0916 1656.6551 3109.7273 3134.3741 3138.0684 3146.2481 3151.7450 3167.0409 3167.0716 3177.2800 3195.4607 3199.9844 3354.5920 3523.4789
redmass: 4.9391 5.2008 6.3887 7.4030 5.2010 6.8235 5.0162 6.4646 5.3804 3.7274 5.1194 5.2133 4.9136 7.8691 6.9651 2.9146 3.0004 5.9174 4.3662 6.0228 2.5053 6.2371 2.2325 5.3455 3.2903 1.9699 6.4409 3.3862 5.8671 7.4632 2.0019 6.7160 6.4148 1.6877 3.1181 1.5973 4.0527 1.2691 5.8184 5.8332 1.4167 1.5030 1.4268 5.5154 1.3563 1.3728 6.1670 1.3081 1.3813 4.3584 2.1503 2.1892 1.6140 2.1797 2.3751 1.5694 1.0823 1.8238 1.1177 3.0581 2.4593 2.1297 1.8949 3.3163 1.4422 2.0894 7.0970 3.7178 2.3283 2.4401 2.7166 2.2305 1.7289 2.0831 7.6500 6.5441 5.0576 9.2224 6.0124 6.6548 5.3548 1.0889 1.0868 1.0863 1.0933 1.0903 1.0984 1.0974 1.0995 1.0951 1.0949 1.0749 1.0760
irintensity: 0.5896 1.0387 0.9870 2.9463 4.7733 3.9976 1.3719 6.1095 5.0412 3.5196 4.7374 5.5797 12.0077 3.6313 10.3363 0.0430 7.8065 20.8122 2.1540 6.7955 28.2791 6.9437 46.7081 4.6542 1.0462 87.2142 1.8814 14.6561 26.5881 2.9850 41.0304 12.6967 10.7890 95.4705 20.4612 60.5279 34.7875 0.1951 16.1045 3.6472 20.4724 3.6371 13.2440 8.4123 0.1473 2.9986 1.4134 2.2669 1.6869 31.5490 1.0508 1.6177 13.2035 12.5252 77.3680 23.2511 15.7136 206.9366 7.6978 69.4873 21.8492 101.3656 2.0042 74.8400 103.2255 55.2245 78.1877 18.8854 103.4615 111.2810 128.1409 248.8072 203.6084 550.0609 60.6241 14.4400 40.1806 342.5922 79.4069 19.0074 82.5463 16.1071 0.1990 4.1562 28.1199 7.0619 29.7931 8.0093 19.5863 6.9387 0.4740 113.5744 20.8473
temp: 298.150 k
press: 1.00000 atm
elementType: 8 8 7 7 7 7 6 6 6 6 6 6 6 6 6 6 6 6 6 6 6 1 1 1 1 1 1 1 1 1 1 1 1
symmnumber: 1
zpe: 649162.6 jmol-1
zpe.correction: 0.247253 hartree
zpe.thermalcorrener: 0.264133 hartree
zpe.thermalcorrenthalpy: 0.265078 hartree
zpe.thermalcorrgfe: 0.200087 hartree
zpe.sumelectzpe: -946.808367 hartree
zpe.sumelectthermal: -946.791487 hartree
zpe.sumelectthermalent: -946.790542 hartree
zpe.sumelectthermalfe: -946.855533 hartree
dipole: 0.3790 2.1009 -0.9547
dipole: 2.3386
quadrupole: -89.9802 -123.1192 -123.2400
quadrupole: 4.8588 -6.1705 -4.5336
quadrupole: 22.1330 -11.0061 -11.1269 4.8588 -6.1705 -4.5336
hfenergy: -947.0556201 hartree
pointgroup: C01 [X(C15H12N4O2)]
dipole: -0.16587 -0.2951326 -0.8555108 debye
polarizability: 362.5668579|-7.63767|136.2315972|14.7383966|40.2632191|147.911334 unknown
InChI: InChI=1S/C15H12N4O2/c20-14-12-8-4-5-9-13(12)16-10-19(14)18-15(21)17-11-6-2-1-3-7-11/h1-10,17-18H
charge 0 multiplicity 1
33 atoms
O  1.513819 -1.588446 -1.601319
O  -1.219671 0.821266 1.055001
N  1.070969 0.428364 -0.520435
N  -0.237786 0.297726 -1.03213
N  2.69119 1.710024 0.682982
N  -2.531767 0.037316 -0.754789
C  3.309452 -0.481209 -0.336625
C  3.629003 0.688821 0.434684
C  1.957712 -0.644112 -0.870464
C  4.295698 -1.476973 -0.572586
C  4.944147 0.831453 0.958528
C  1.472284 1.55602 0.202546
C  5.586188 -1.318666 -0.045543
C  5.907969 -0.161062 0.721773
C  -3.842992 0.01581 -0.192212
C  -1.343115 0.398446 -0.126499
C  -4.902763 -0.396974 -1.04421
C  -4.11848 0.381479 1.151643
C  -6.225592 -0.442441 -0.560332
C  -5.449531 0.328532 1.61951
C  -6.508715 -0.079319 0.776994
H  4.019504 -2.355386 -1.164856
H  5.168325 1.728729 1.542731
H  0.70726 2.315277 0.368548
H  -0.22164 -0.456699 -1.741493
H  6.349033 -2.083886 -0.222734
H  6.918007 -0.04544 1.129682
H  -2.479691 -0.209729 -1.746032
H  -4.692346 -0.684094 -2.083029
H  -3.302834 0.698164 1.8038
H  -7.032909 -0.762445 -1.228099
H  -5.656253 0.611802 2.657607
H  -7.536073 -0.114851 1.154056
