program: Gaussian 09
title: 000287760
version: EM64L-G09RevD.01
frameworkgroup: C1[X(C18H27NO)]
method: RPBEPBE
basis: SDD
operation: Freq
keyword: #p
keyword: freq=noraman
keyword: PBEPBE/SDD
title: #p freq=noraman PBEPBE/SDD
converged: YES YES NO NO
title: Mulliken charges:
elementType: O N C C C C C C C C C C C C C C C C C C H H H H H H H H H H H H H H H H H H H H H H H H H H H
charge: -0.449387 -0.099182 -0.029764 -0.466556 -0.395128 -0.360408 -0.360206 -0.381318 -0.411572 -0.410045 0.504289 -0.398030 -0.588330 0.403246 -0.690351 -0.688092 0.326029 0.352289 -0.824408 -0.822018 0.172989 0.210869 0.213651 0.219832 0.166182 0.226077 0.222035 0.168588 0.190647 0.230390 0.188454 0.211813 0.206235 0.189718 0.212818 0.186790 0.229756 0.201659 0.223142 0.232965 0.331632 0.224567 0.228413 0.222431 0.230690 0.223924 0.222674
chargesum: 0.00000
title: Mulliken charges with hydrogens summed into heavy atoms:
elementType: O N C C C C C C C C C C C C C C C C C C
charge: -0.117755 -0.099182 0.143225 -0.042035 -0.175296 0.031851 0.030417 0.039720 -0.011305 -0.014092 0.504289 0.001577 -0.156915 0.403246 -0.467209 -0.455127 0.326029 0.352289 -0.148998 -0.144730
polarizability: 2.20728230e+02 -2.30811762e+01 2.02830046e+02 -1.25615758e+01 -1.02284495e+01 1.76340664e+02
1716.lowfreq: 0.0005 0.0007 0.0008 3.0021 8.7590 13.7351 32.1939 45.2539 65.8610
frequency: 31.9924 44.8726 65.8329 84.1060 112.9053 134.6540 143.5413 151.7670 169.3824 201.6388 224.9043 225.8972 235.5812 260.0779 273.0627 284.6656 286.8721 297.4682 313.8319 359.5931 379.4916 393.3322 430.5437 435.4244 444.7964 447.1754 477.2801 485.0494 525.7754 547.4232 589.0102 631.5526 646.2727 711.6027 722.1395 755.9165 761.3472 803.8508 809.6410 826.5789 853.8319 861.1094 871.6239 889.5852 893.9473 898.9157 922.9645 951.1922 957.9700 966.1020 988.6146 992.9639 1006.6037 1026.9378 1028.6796 1050.5643 1053.3089 1063.9948 1072.4345 1084.8187 1105.7389 1123.1483 1132.9672 1149.5277 1155.4278 1165.3155 1181.2315 1188.5072 1216.2974 1229.5565 1242.2822 1257.6078 1261.1492 1271.4769 1272.9468 1286.0606 1290.2481 1300.3144 1321.1169 1333.8714 1335.6252 1343.3201 1350.4040 1353.7164 1358.8103 1369.8341 1372.4172 1376.3007 1384.8592 1390.7913 1392.8611 1402.5223 1432.7485 1451.9983 1459.2479 1460.4519 1462.7856 1463.1466 1465.3498 1469.5549 1472.4837 1473.0391 1476.7692 1477.2491 1483.6894 1510.0613 1579.7198 1625.0296 2738.8630 2804.9937 2819.1819 2964.4014 2965.9745 2966.1425 2972.2708 2973.6630 2980.7644 2984.8208 2985.8091 3000.0028 3030.6676 3031.7846 3034.8535 3038.0310 3038.9677 3043.1993 3050.0880 3052.4508 3065.8837 3072.6520 3076.8742 3080.4310 3095.1764 3110.4657 3524.8458
redmass: 3.9037 3.1138 3.1038 3.3312 1.0505 2.1008 2.3404 1.5266 4.0907 3.1694 2.7492 2.7261 2.2475 2.6854 1.2665 2.9166 2.6979 2.3526 3.1048 3.9772 1.8082 3.7977 3.1883 2.4992 3.1227 2.6711 2.2286 3.0390 4.4152 2.3241 2.4669 2.8543 3.5530 4.5503 3.4876 3.7170 3.1270 1.4922 3.1702 2.7952 2.2185 1.5596 1.8516 2.6126 1.4910 1.5342 2.4315 2.4670 1.3960 3.4127 2.6569 1.4842 1.7141 1.7700 1.6754 2.2165 1.6517 1.9939 2.1856 1.9340 1.9333 2.5417 2.0867 1.8305 1.4873 2.2648 1.2964 1.3430 1.3968 1.6928 1.5309 1.2902 1.3088 1.3271 1.9395 1.2732 1.2921 1.4361 1.4482 1.3921 1.4666 1.3604 1.4383 1.5479 1.4166 2.2756 2.0080 1.4360 1.7412 1.3258 1.4788 1.2565 1.6906 1.0886 1.0837 1.0487 1.0978 1.0887 1.0923 1.0948 1.1540 1.0587 1.1345 1.0946 1.0889 2.9010 6.8587 6.5955 1.0786 1.0720 1.0705 1.0373 1.0387 1.0616 1.0620 1.0830 1.0620 1.0614 1.0612 1.0626 1.0998 1.0967 1.0969 1.0996 1.0968 1.1028 1.0996 1.1028 1.0858 1.0858 1.0984 1.0978 1.0898 1.0902 1.0657
irintensity: 0.0744 0.2058 0.1143 1.3006 0.0250 3.2795 1.2919 1.4473 1.0108 3.0424 1.8404 0.6276 0.0924 11.9275 123.2788 9.4466 0.1224 2.9676 2.9400 0.9654 2.2862 3.6255 4.5998 3.2999 2.4233 0.4171 0.6646 3.2627 2.0633 2.5957 0.2592 1.1285 5.0940 3.9574 12.7505 5.0928 2.8927 0.0131 2.4657 7.0733 28.1529 2.1730 7.4926 9.3521 21.8065 4.0267 0.8973 18.9304 10.0455 54.3247 7.3592 14.7208 5.7524 5.7289 10.7121 5.3513 0.0051 13.5975 16.4185 9.4662 23.6646 6.5399 2.1130 6.7593 5.6849 10.3121 20.4633 24.2751 4.4076 6.1846 6.6682 2.7223 3.4680 10.1483 1.0858 1.2864 1.2867 11.5023 11.9931 2.6820 1.8905 0.6690 2.2318 3.7082 2.4952 5.9286 2.2449 1.5283 0.6851 8.9396 1.6427 11.4219 21.7719 5.3904 3.3200 0.5721 6.6561 19.1937 3.9955 13.2389 25.1270 29.2148 0.8972 17.5662 11.5108 21.1074 1.2359 7.2911 112.0193 44.0990 213.8442 71.0426 29.8558 34.4030 20.2559 50.2608 44.8003 41.1792 29.3783 49.4973 34.7776 62.9801 46.4486 20.9171 0.8092 35.2695 47.8799 79.8047 45.1352 22.1631 29.0942 10.6227 35.5079 16.3528 7.8156
temp: 298.150 k
press: 1.00000 atm
elementType: 8 7 6 6 6 6 6 6 6 6 6 6 6 6 6 6 6 6 6 6 1 1 1 1 1 1 1 1 1 1 1 1 1 1 1 1 1 1 1 1 1 1 1 1 1 1 1
symmnumber: 1
zpe: 1084689.1 jmol-1
zpe.correction: 0.413136 hartree
zpe.thermalcorrener: 0.432663 hartree
zpe.thermalcorrenthalpy: 0.433607 hartree
zpe.thermalcorrgfe: 0.366381 hartree
zpe.sumelectzpe: -830.534092 hartree
zpe.sumelectthermal: -830.514565 hartree
zpe.sumelectthermalent: -830.513621 hartree
zpe.sumelectthermalfe: -830.580847 hartree
dipole: -1.6788 -1.0853 0.3403
dipole: 2.0278
quadrupole: -115.7447 -120.0638 -117.1621
quadrupole: -7.1714 -6.0369 -2.4250
quadrupole: 1.9122 -2.4070 0.4948 -7.1714 -6.0369 -2.4250
hfenergy: -830.9472279 hartree
pointgroup: C01 [X(C18H27N1O1)]
dipole: -0.6769277 0.4045875 -0.1207633 debye
polarizability: 219.1913183|23.3562685|204.9418617|13.0491562|-9.3841472|175.7657609 unknown
InChI: InChI=1S/C18H27NO/c1-13-11-15-7-6-8-17(19-9-4-3-5-10-19)18(20)16(15)12-14(13)2/h11-12,17-18,20H,3-10H2,1-2H3
charge 0 multiplicity 1
47 atoms
O  0.202516 -2.258681 -2.164599
N  -2.001013 0.067955 -0.062166
C  -1.590577 -1.16112 -0.810103
C  -1.59492 -2.430397 0.078702
C  -0.213492 -0.971466 -1.543394
C  -2.029038 1.283303 -0.923543
C  -3.3080 -0.099703 0.633583
C  -0.696632 -2.364663 1.333207
C  -2.365311 2.556932 -0.12095
C  -3.672114 1.134367 1.483592
C  0.951668 -0.467985 -0.704684
C  -3.70944 2.41267 0.621431
C  0.820583 -2.410175 1.009005
C  1.417858 -1.114591 0.474629
C  1.617045 0.699915 -1.148116
C  2.516972 -0.537873 1.157023
C  2.713353 1.274551 -0.465244
C  3.172141 0.640111 0.724738
C  3.382701 2.529673 -0.99682
C  4.343461 1.20352 1.509283
H  -2.335599 -1.359551 -1.637817
H  -1.250858 -3.269961 -0.555103
H  -2.63501 -2.672391 0.366866
H  -0.368885 -0.248003 -2.369061
H  -2.776935 1.160788 -1.754597
H  -1.038074 1.420989 -1.384148
H  -3.253099 -0.978982 1.295359
H  -4.131627 -0.2921 -0.107364
H  -0.936144 -3.236734 1.97428
H  -0.923243 -1.452827 1.917257
H  -2.386297 3.421922 -0.812136
H  -1.554863 2.73417 0.612335
H  -2.913938 1.251034 2.282433
H  -4.649723 0.958223 1.973081
H  -3.910063 3.303189 1.246816
H  -4.536212 2.339267 -0.115668
H  0.991506 -3.218209 0.269495
H  1.370322 -2.693194 1.927019
H  1.274405 1.179516 -2.075655
H  2.87936 -1.032671 2.067795
H  -0.505627 -2.532676 -2.804607
H  4.453013 2.357387 -1.223503
H  2.895689 2.879364 -1.923224
H  3.344341 3.357447 -0.26196
H  4.56047 0.590493 2.400594
H  5.264093 1.243747 0.894852
H  4.145937 2.238419 1.850583
