program: Gaussian 09
title: 000289041
version: EM64L-G09RevD.01
frameworkgroup: C1[X(C5H5N5O)]
method: RPBEPBE
basis: SDD
operation: Freq
keyword: #pfreq=noraman
keyword: PBEPBE/SDD
title: #p freq=noraman PBEPBE/SDD
converged: NO YES NO NO
title: Mulliken charges:
elementType: O N N N N N C C C C C H H H H H
charge: -0.307911 -0.270678 -0.061943 -0.629412 -0.619373 -0.039931 0.337287 0.111624 -0.359338 0.316794 -0.217367 0.283980 0.387062 0.346674 0.351452 0.371080
chargesum: 0.00000
title: Mulliken charges with hydrogens summed into heavy atoms:
elementType: O N N N N N C C C C C
charge: -0.307911 -0.270678 -0.061943 0.104324 0.103159 -0.039931 0.337287 0.111624 -0.075358 0.316794 -0.217367
polarizability: 1.38830578e+02 5.02446259e+00 9.53651070e+01 -7.42509812e-03 -3.63379553e-03 3.74920021e+01
1716.lowfreq: -9.7330 -9.0756 -7.1393 -0.0007 -0.0005 0.0001 78.9346 115.0075 116.0285
frequency: 78.9333 115.0054 116.0263 206.4806 235.5363 285.7102 347.6958 383.5048 471.6613 475.6123 512.6013 548.1773 549.4138 583.6479 613.0738 666.7629 678.1027 706.1691 720.7127 728.6253 735.5855 867.5599 917.0129 1059.6795 1104.0114 1136.6129 1204.7104 1222.2994 1326.9974 1384.2188 1415.3595 1510.7803 1541.7095 1572.3871 1630.7902 1688.1182 2174.1261 3229.9718 3443.6526 3494.5450 3651.9821 3685.3969
redmass: 7.2771 7.1356 9.0572 7.8957 4.4291 5.3552 3.4770 7.2903 1.2352 6.7822 5.4655 7.5326 1.2215 4.3224 4.7266 1.1347 1.3078 3.5911 5.7893 7.4691 5.6916 1.3668 3.1714 2.2678 5.6180 2.0247 1.5078 5.7335 5.8918 5.6791 4.5359 2.3673 2.3267 1.2827 3.3435 6.1807 12.5781 1.0985 1.0526 1.0490 1.0986 1.1012
irintensity: 0.0086 9.3912 3.5968 11.7847 24.7134 6.1355 4.4718 0.4329 89.3797 2.5802 30.5373 4.2500 137.9322 5.6179 11.6531 52.0673 183.4985 47.3951 52.2031 105.3607 6.4624 17.9589 29.9213 2.5157 3.0968 12.4192 6.0139 5.6844 26.0368 73.7433 395.1835 81.6575 38.5667 451.9375 205.8028 358.2348 116.1774 0.5867 153.6426 72.6486 84.0670 105.8296
temp: 298.150 k
press: 1.00000 atm
elementType: 8 7 7 7 7 7 6 6 6 6 6 1 1 1 1 1
symmnumber: 1
zpe: 293210.5 jmol-1
zpe.correction: 0.111678 hartree
zpe.thermalcorrener: 0.121215 hartree
zpe.thermalcorrenthalpy: 0.122159 hartree
zpe.thermalcorrgfe: 0.076833 hartree
zpe.sumelectzpe: -541.734588 hartree
zpe.sumelectthermal: -541.725051 hartree
zpe.sumelectthermalent: -541.724107 hartree
zpe.sumelectthermalfe: -541.769433 hartree
dipole: -4.2549 -0.7468 0.0003
dipole: 4.3199
quadrupole: -74.4983 -56.0927 -65.4482
quadrupole: 5.9131 -0.0012 -0.0009
quadrupole: -9.1518 9.2537 -0.1018 5.9131 -0.0012 -0.0009
hfenergy: -541.846266 hartree
pointgroup: C01 [X(C5H5N5O1)]
dipole: 1.6704678 0.3132228 0.000106 debye
dipolederiv: -0.8219345 0.1482957 -0.0000501 0.2192555 -1.0247141 0.0000154 0. -0.0001095 -0.3822539 -1.514113 -0.1012189 -0.0001569 0.2935188 -0.3876978 0.0000048 -0.0002051 -0.0000436 -0.0459217 -0.698693 -0.3258236 -0.0000767 -0.3911965 -0.1402989 -0.0000514 -0.0000875 -0.0000409 -0.2143539 -0.3516845 0.019724 0.0000622 0.1616962 -1.2871312 -0.0000238 0.0000603 -0.0000453 -0.624042 -1.0096764 -0.4418122 -0.0001149 -0.5023566 -0.7704423 -0.0000683 -0.0000862 -0.0000295 -0.6857854 -0.6751989 -0.0009576 -0.0002147 -0.1247803 -0.2409133 -0.0000523 -0.0000045 -0.0000039 -0.2628263 0.9417227 -0.2175096 0.0000731 -0.1274839 1.2928019 0.000048 0.0000555 0.0000208 0.1895812 -0.6683478 0.2405255 -0.0000439 -0.1143604 -0.4132186 -0.0000256 -0.0001332 0.0000166 -0.0547696 0.2831555 0.3438929 0.0000654 0.3444449 0.4915657 0.0000808 0.0000296 0.0000868 -0.0415649 2.3371626 0.097543 0.0002366 -0.0765723 1.4787855 0.0000527 0.000214 0.0001368 0.3361379 0.893289 0.0702927 0.0002462 0.2598204 -0.0719264 0.000047 0.0001608 0.0000106 0.0582688 0.0772626 0.0440141 -0.0000078 0.0302317 0.0380966 -0.0000057 -0.0000116 0.000001 0.1703401 0.3969964 -0.0012167 -0.0000059 -0.0081702 0.3036071 -0.0000086 -0.0000105 -0.0000141 0.3796752 0.1418284 0.0456764 -0.0000396 -0.0013009 0.2777406 0.0000019 -0.0000338 0.0000141 0.3916403 0.2784384 0.0533721 0.0000028 0.0182671 0.1958772 -0.0000094 0.0000133 -0.0000057 0.4008202 0.3897925 0.0252022 0.0000242 0.0189866 0.2578679 -0.0000053 0.0000388 0.0000059 0.385054 unknown
polarizability: 138.7081427|5.5273805|95.4875421|0.0073824|0.0037197|37.4920021 unknown
InChI: InChI=1S/C5H5N5O/c6-1-3-2-9-10(4(3)7)5(8)11/h2H,7-8H2
charge 0 multiplicity 1
16 atoms
O  2.499124 -1.461999 0.000087
N  0.873533 0.223442 0.000118
N  0.563633 1.61567 0.000138
N  -0.219829 -1.939815 -0.000189
N  3.127547 0.807851 0.000369
N  -3.892462 -0.367738 -0.00022
C  -0.268493 -0.57881 -0.000117
C  -1.369889 0.323745 -0.000255
C  -0.784977 1.640339 -0.000036
C  2.231277 -0.221714 0.000286
C  -2.737653 -0.043578 -0.000514
H  -1.312532 2.592466 -0.000047
H  0.702783 -2.388315 -0.000036
H  -1.083669 -2.47691 -0.000368
H  4.121063 0.593793 0.000364
H  2.772047 1.767373 0.000421
