program: Gaussian 09
title: 000289034
version: EM64L-G09RevD.01
frameworkgroup: C1[X(C15H14BrN3O)]
method: RPBEPBE
basis: SDD
operation: Freq
keyword: #p
keyword: freq=noraman
keyword: PBEPBE/SDD
title: #p freq=noraman PBEPBE/SDD
converged: YES YES NO NO
title: Mulliken charges:
elementType: Br O N N N C C C C C C C C C C C C C C C H H H H H H H H H H H H H H
charge: -0.022421 -0.434158 -0.116356 -0.424254 -0.674088 0.298322 0.386982 0.184864 -0.195959 -0.011209 0.404524 -0.352527 -0.368202 -0.366201 -0.382475 -0.418988 -0.227890 -0.251573 -0.261154 -0.309043 0.231150 0.236380 0.198641 0.296084 0.261524 0.213416 0.246015 0.234061 0.232761 0.222124 0.177812 0.337790 0.305533 0.348518
chargesum: 0.00000
title: Mulliken charges with hydrogens summed into heavy atoms:
elementType: Br O N N N C C C C C C C C C C C C C C C
charge: -0.022421 -0.085640 -0.116356 -0.128170 -0.030765 0.298322 0.386982 0.184864 -0.195959 -0.011209 0.404524 -0.121377 -0.131822 -0.167560 0.092464 -0.172973 -0.227890 -0.017512 -0.028393 0.090892
polarizability: 3.31052266e+02 -1.67330764e+01 2.60570109e+02 1.16213188e+01 9.00697478e+00 9.10598411e+01
1716.lowfreq: -4.3538 0.0003 0.0003 0.0004 4.7674 7.1500 19.2215 32.8958 53.6677
frequency: 19.1365 32.8866 53.6653 74.2710 102.1751 113.3327 130.7728 155.2459 190.5830 207.5429 217.3826 234.9629 247.4064 285.2788 293.0639 358.2469 366.5471 399.8237 413.4015 416.5381 443.2027 458.1683 484.0447 491.9851 526.0011 540.1499 567.3715 585.3632 596.8480 614.3840 621.0453 651.8052 660.8664 709.5607 748.0192 773.2909 787.1924 805.1879 831.5075 847.6389 850.7198 869.6826 883.4196 888.3001 922.2298 949.9155 991.1030 1005.8384 1028.1697 1041.8990 1056.0765 1087.0831 1098.4931 1111.5363 1132.5439 1180.7332 1187.1772 1190.3348 1210.7769 1252.1853 1279.4185 1293.6987 1301.6987 1314.8586 1339.6641 1362.4452 1378.8019 1391.6203 1398.7266 1414.6086 1435.0569 1453.4437 1467.4630 1473.5284 1484.3946 1518.5459 1532.4052 1565.1560 1582.8372 1587.6470 1610.2359 1620.8213 2923.9040 2957.6587 3072.1802 3095.0159 3121.6969 3138.4562 3155.7766 3161.0541 3170.1518 3182.7022 3517.3506 3526.8303 3554.1382 3697.3070
redmass: 6.1848 6.5696 5.6927 4.6452 4.3873 4.3848 4.5200 5.0947 3.7006 4.6096 4.6989 4.5480 4.4954 3.0615 4.0359 2.9994 1.5788 1.9184 1.8816 3.2945 2.9284 4.1628 3.5273 2.9871 5.2874 1.4688 3.1275 1.9145 4.5577 1.6227 5.5330 5.7930 3.9797 7.0518 2.4124 1.8360 2.1452 6.7649 1.6909 1.9080 2.7360 1.9175 1.8822 4.2662 7.4242 1.3934 1.3436 3.1150 1.7169 3.0290 2.6033 2.4982 2.1919 1.6064 2.3091 1.4774 1.2774 1.5188 1.2356 1.5257 1.6800 2.9501 1.7272 1.4446 2.1131 2.1005 1.2672 7.2530 3.9404 2.5906 3.6124 2.6367 1.1284 1.3322 2.5285 2.0686 4.6817 1.9919 4.9989 5.7410 2.8786 5.8206 1.0713 1.0708 1.0916 1.0911 1.0864 1.0882 1.0939 1.0922 1.0996 1.0910 1.0654 1.0460 1.0754 1.1022
irintensity: 2.6239 0.9231 1.0233 0.7652 1.7598 9.0525 3.5336 1.1628 4.2263 2.5893 3.0740 8.2231 0.2837 3.1676 1.3605 20.5309 118.2205 31.4586 75.9105 27.5597 27.3386 36.1506 2.5788 12.9430 22.7362 125.1776 67.8071 52.1705 9.5007 14.4113 3.9720 0.0887 33.8779 13.9150 25.2320 71.7307 8.3086 37.2829 0.2312 42.3863 23.6167 0.0230 6.4632 33.2037 30.5252 1.0715 0.0216 52.2850 15.6294 23.0657 20.8832 12.4148 6.3706 6.8396 65.5400 15.7550 14.6977 23.8223 69.3400 0.7771 18.4945 3.1637 84.4615 9.2948 5.5300 21.8048 44.5815 15.2988 89.7424 72.8729 51.1552 0.2068 21.2314 45.3406 3.2411 205.4317 225.8941 31.6674 28.2139 147.2741 395.6061 7.3766 80.1393 91.2176 38.7917 11.8105 10.6229 8.2281 25.1568 6.1749 21.3233 3.8212 8.4681 65.1697 26.8632 56.5250
temp: 298.150 k
press: 1.00000 atm
elementType: 35 8 7 7 7 6 6 6 6 6 6 6 6 6 6 6 6 6 6 6 1 1 1 1 1 1 1 1 1 1 1 1 1 1
symmnumber: 1
zpe: 688303.8 jmol-1
zpe.correction: 0.262161 hartree
zpe.thermalcorrener: 0.280131 hartree
zpe.thermalcorrenthalpy: 0.281076 hartree
zpe.thermalcorrgfe: 0.214402 hartree
zpe.sumelectzpe: -831.549690 hartree
zpe.sumelectthermal: -831.531720 hartree
zpe.sumelectthermalent: -831.530775 hartree
zpe.sumelectthermalfe: -831.597449 hartree
dipole: -3.4577 1.0778 -2.2626
dipole: 4.2705
quadrupole: -129.0001 -103.1916 -135.3683
quadrupole: -9.4262 13.7314 6.7203
quadrupole: -6.4801 19.3284 -12.8483 -9.4262 13.7314 6.7203
hfenergy: -831.8118511 hartree
pointgroup: C01 [X(C15H14Br1N3O1)]
dipole: -1.3131133 0.3147609 -0.9997562 debye
polarizability: 329.6080066|-13.1740683|259.9327906|27.7205242|-2.3288987|93.141419 unknown
InChI: InChI=1S/C15H14BrN3O/c16-9-7-12-10-3-1-2-4-11(10)15(18-5-6-20)19-14(12)13(17)8-9/h1-4,7-8,18,20H,5-6,17H2
charge 0 multiplicity 1
34 atoms
Br 5.54671 -0.145088 0.612704
O  -4.468252 -1.906562 1.465419
N  -0.470375 -1.215344 -0.196502
N  -2.711169 -0.577001 -0.495416
N  1.23063 -3.292669 0.074808
C  0.39553 1.519215 -0.078217
C  1.375578 0.437411 0.05055
C  -0.997771 1.189441 -0.240233
C  0.872533 -0.900636 -0.000209
C  -1.367688 -0.232846 -0.31436
C  1.774389 -2.023914 0.13443
C  0.763914 2.897499 -0.03391
C  2.774392 0.661086 0.230787
C  -1.960626 2.240001 -0.317126
C  -3.175392 -1.966083 -0.65649
C  3.156474 -1.783787 0.315989
C  3.615842 -0.44828 0.358383
C  -0.19496 3.913879 -0.132774
C  -1.571382 3.585389 -0.268404
C  -4.544999 -2.141204 0.023144
H  1.816224 3.171492 0.083543
H  3.190796 1.668703 0.274001
H  -3.030522 2.01488 -0.395478
H  -3.332054 0.150244 -0.852696
H  -2.425488 -2.614989 -0.177584
H  -3.238978 -2.254382 -1.727765
H  3.856202 -2.617882 0.420915
H  0.115148 4.963672 -0.096304
H  -2.323599 4.379017 -0.327067
H  -4.895038 -3.180174 -0.097091
H  -5.297547 -1.466851 -0.446813
H  0.221842 -3.352898 -0.061196
H  1.799082 -4.12744 0.171005
H  -3.892844 -1.108602 1.604957
