program: Gaussian 09
title: 000289037
version: EM64L-G09RevD.01
frameworkgroup: C1[X(C15H12ClN3O3)]
method: RPBEPBE
basis: SDD
operation: Freq
keyword: #p
keyword: freq=noraman
keyword: PBEPBE/SDD
title: #p freq=noraman PBEPBE/SDD
converged: YES YES NO NO
title: Mulliken charges:
elementType: Cl O O O N N N C C C C C C C C C C C C C C C H H H H H H H H H H H H
charge: -0.040616 -0.465588 -0.193952 -0.209656 -0.028875 -0.374037 0.017092 0.315664 0.361123 0.231160 -0.215265 -0.025034 0.364165 -0.351921 -0.339137 -0.358700 -0.387118 -0.399658 -0.147181 -0.247396 -0.257425 -0.296026 0.228934 0.249451 0.202397 0.307988 0.261329 0.216135 0.301108 0.239169 0.238797 0.211723 0.218162 0.373189
chargesum: 0.00000
title: Mulliken charges with hydrogens summed into heavy atoms:
elementType: Cl O O O N N N C C C C C C C C C C C C C C C
charge: -0.040616 -0.092399 -0.193952 -0.209656 -0.028875 -0.066049 0.017092 0.315664 0.361123 0.231160 -0.215265 -0.025034 0.364165 -0.122987 -0.089686 -0.156303 0.090346 -0.098550 -0.147181 -0.008226 -0.018629 0.133859
polarizability: 3.20420386e+02 -2.12927654e+01 2.92020332e+02 1.46653360e+00 8.26492572e+00 9.20535415e+01
1716.lowfreq: -0.0005 0.0018 0.0020 2.2933 3.3813 8.7513 27.9201 55.5201 58.4369
frequency: 27.9157 55.5120 58.4328 73.8105 79.9828 95.7610 125.7827 141.1389 155.0983 163.2938 174.5177 198.0666 246.5668 257.0863 310.0589 317.2784 341.3776 358.1162 381.3917 394.2273 406.2121 440.8984 452.7005 480.8288 488.3949 503.0260 524.7915 571.4491 581.9632 611.4141 632.4826 645.4206 665.6575 688.5897 701.0260 718.9950 748.2340 770.4627 775.8963 795.2543 823.3526 856.9336 869.3226 886.1143 890.0028 902.1491 953.1292 987.1847 995.2080 999.4559 1018.8295 1041.2786 1047.7774 1059.2905 1096.1279 1118.6403 1149.7361 1185.5288 1191.4149 1198.0309 1218.7046 1256.8834 1271.4917 1296.8898 1309.5569 1317.9709 1337.7498 1351.3274 1365.4183 1371.8246 1376.4397 1390.9090 1416.6927 1426.1952 1436.7030 1447.2979 1461.6230 1475.3801 1506.6507 1534.5626 1547.3771 1585.0601 1597.4880 1620.8982 2990.7276 3024.6583 3066.2296 3098.5569 3127.6412 3142.2641 3157.5025 3170.6656 3175.4282 3187.7848 3472.2002 3598.7706
redmass: 8.3447 5.7073 7.2360 6.1909 3.5875 5.3592 6.0182 4.7124 7.7430 5.3354 5.6876 5.5538 4.3157 4.9228 4.3556 11.2352 6.2435 3.0719 4.0758 3.8618 3.7259 4.6554 2.0808 6.0330 6.1785 5.2157 3.9070 3.6360 1.0746 6.1283 6.3274 5.3004 4.2018 9.6362 6.4963 6.5882 2.8484 1.7413 1.8318 3.1989 4.6414 8.9104 1.7183 1.7218 3.9506 1.4704 1.3946 5.2094 1.3549 5.0184 4.5731 4.6224 1.8316 2.2083 2.3177 2.1205 2.2687 1.3185 1.3871 1.7629 3.3495 1.6912 1.4283 2.0050 1.9226 1.5505 1.7928 7.9299 1.2808 4.1430 1.1941 4.3823 3.4483 3.5157 1.4208 2.2549 1.0970 2.8290 2.9522 5.0911 4.9094 7.8212 7.3860 6.0954 1.0615 1.0591 1.1026 1.1065 1.0868 1.0880 1.0940 1.0964 1.0948 1.0933 1.0670 1.0777
irintensity: 0.4239 0.7744 0.0517 0.3813 7.0687 1.6520 1.2664 0.5201 0.8168 0.3183 5.0540 1.3412 1.2873 1.2228 1.2560 1.7990 0.7954 1.0346 10.2561 14.8946 31.0918 6.3145 31.3800 2.2552 2.8259 4.6251 4.1337 35.4937 120.6023 23.9598 13.9184 9.9693 25.4999 26.2112 5.1918 4.6671 10.4198 14.9270 57.1007 9.5043 43.0232 5.8657 0.8348 23.0894 18.8486 8.6191 0.8287 22.2785 0.2894 55.4854 14.6433 11.8933 11.9717 12.0033 2.6264 22.9587 2.9406 13.3712 80.5883 25.8344 250.0954 0.9522 1.7663 20.7430 17.0473 2.1520 20.6569 100.3643 10.6857 31.2788 30.1592 9.7636 55.2841 16.9765 95.6927 41.4915 7.6061 56.6954 68.2268 437.9929 37.6712 149.6848 1.8503 8.4415 42.7668 48.3252 41.3442 41.4260 8.3075 4.2517 17.3969 11.3046 14.9117 7.6197 48.6536 73.2881
temp: 298.150 k
press: 1.00000 atm
elementType: 17 8 8 8 7 7 7 6 6 6 6 6 6 6 6 6 6 6 6 6 6 6 1 1 1 1 1 1 1 1 1 1 1 1
symmnumber: 1
zpe: 649345.8 jmol-1
zpe.correction: 0.247323 hartree
zpe.thermalcorrener: 0.266165 hartree
zpe.thermalcorrenthalpy: 0.267109 hartree
zpe.thermalcorrgfe: 0.199385 hartree
zpe.sumelectzpe: -1427.163328 hartree
zpe.sumelectthermal: -1427.144486 hartree
zpe.sumelectthermalent: -1427.143542 hartree
zpe.sumelectthermalfe: -1427.211266 hartree
dipole: -1.5137 9.3399 -0.2094
dipole: 9.4641
quadrupole: -126.6356 -138.9340 -138.1952
quadrupole: -15.6923 5.3770 0.7740
quadrupole: 7.9527 -4.3458 -3.6069 -15.6923 5.3770 0.7740
hfenergy: -1427.4106512 hartree
pointgroup: C01 [X(C15H12Cl1N3O3)]
dipole: -1.4270778 3.3730489 -0.6709289 debye
polarizability: 322.330516|-9.4656943|283.0709164|39.5136682|-12.6349403|99.0928272 unknown
InChI: InChI=1S/C15H12ClN3O3/c16-9-7-12-10-3-1-2-4-11(10)15(17-5-6-20)18-14(12)13(8-9)19(21)22/h1-4,7-8,17,20H,5-6H2
charge 0 multiplicity 1
34 atoms
Cl 4.858817 1.054313 0.93901
O  -2.593321 -3.965626 0.616223
O  2.22345 -3.532251 0.04606
O  0.189292 -3.155489 1.002487
N  -0.749827 -0.838531 -0.21136
N  -2.953659 -0.550925 -0.826394
N  1.296088 -2.740992 0.480979
C  -0.264442 1.99332 -0.150735
C  0.827275 1.04815 0.118504
C  -1.578131 1.481898 -0.438984
C  0.497162 -0.360323 0.111806
C  -1.747458 0.019231 -0.486266
C  1.552988 -1.290269 0.412561
C  -0.078882 3.407424 -0.127318
C  2.16038 1.456224 0.380862
C  -2.649444 2.390191 -0.675502
C  -3.117376 -2.017488 -0.849558
C  2.877831 -0.880524 0.634402
C  3.155812 0.499131 0.62126
C  -1.143948 4.285496 -0.370134
C  -2.441667 3.776294 -0.643838
C  -3.19918 -2.642657 0.581877
H  0.90815 3.826108 0.089208
H  2.433522 2.514207 0.393179
H  -3.660993 2.021434 -0.88005
H  -3.748463 0.043233 -1.051658
H  -2.241843 -2.459348 -1.354227
H  -4.019051 -2.250157 -1.44203
H  3.655464 -1.625409 0.819238
H  -0.97606 5.367209 -0.344265
H  -3.274739 4.462698 -0.8263
H  -4.250215 -2.787899 0.884907
H  -2.709747 -1.955879 1.29949
H  -1.603382 -3.861793 0.650071
