program: Gaussian 09
title: 000288973
version: EM64L-G09RevD.01
frameworkgroup: C1[X(C22H26O2)]
method: RPBEPBE
basis: SDD
operation: Freq
keyword: #pfreq=noraman
keyword: PBEPBE/SDD
title: #p freq=noraman PBEPBE/SDD
converged: YES YES NO NO
title: Mulliken charges:
elementType: O O C C C C C C C C C C C C C C C C C C C C C C H H H H H H H H H H H H H H H H H H H H H H H H H H
charge: -0.299932 -0.299923 0.149019 -0.527004 -0.527096 0.437046 -0.494847 -0.494825 0.239019 0.239154 0.119960 0.119949 -0.409805 -0.409948 -0.405773 -0.405767 -0.265256 -0.265171 -0.220165 -0.220176 -0.238379 -0.238382 -0.689632 -0.689637 0.229856 0.239941 0.229858 0.239950 0.234520 0.202518 0.234500 0.202501 0.240226 0.240260 0.241393 0.241395 0.223668 0.223666 0.216397 0.192337 0.216400 0.192349 0.225755 0.225753 0.204654 0.225892 0.221615 0.204656 0.225894 0.221614
chargesum: 0.00000
title: Mulliken charges with hydrogens summed into heavy atoms:
elementType: O O C C C C C C C C C C C C C C C C C C C C C C
charge: -0.299932 -0.299923 0.149019 -0.057207 -0.057288 0.437046 -0.057809 -0.057823 0.239019 0.239154 0.119960 0.119949 -0.169579 -0.169688 -0.164380 -0.164373 -0.041588 -0.041505 0.188570 0.188574 -0.012624 -0.012629 -0.037470 -0.037474
polarizability: 2.90830165e+02 1.21002450e-02 2.98034114e+02 2.04587338e-02 -7.06847982e+00 1.41990962e+02
1716.lowfreq: -7.1638 -3.1067 -0.0006 -0.0001 0.0006 5.5062 18.8399 37.2717 43.1092
frequency: 16.7494 37.1894 43.0314 53.2927 64.6995 89.7554 96.0903 116.8043 127.3551 135.0283 156.5096 184.5760 186.1651 233.8712 246.7795 251.5585 257.2113 262.4154 302.3054 319.1181 342.7258 345.1446 375.4008 398.5067 408.4657 425.0334 440.5685 461.1955 486.6923 508.5419 527.9096 567.8773 569.8797 590.0208 612.1156 612.7588 620.7314 688.9000 703.7662 741.1983 751.5446 755.2088 757.7526 770.4260 779.6901 798.0654 812.2043 814.4879 857.2942 871.5260 877.2059 880.4769 905.8391 919.6427 940.1599 945.2943 946.3265 964.1256 982.6501 984.6290 996.5317 1005.3681 1026.3404 1027.4408 1031.7072 1037.9030 1054.2645 1058.5451 1074.2881 1102.2433 1103.8506 1106.5415 1111.7731 1114.2738 1136.3411 1140.3487 1158.3205 1162.7909 1175.2033 1175.7865 1182.6671 1203.0109 1230.7432 1240.8492 1245.9581 1248.7666 1267.9076 1268.2309 1293.3760 1304.5202 1319.6344 1329.5181 1337.7470 1345.8953 1357.6578 1362.7386 1376.4275 1394.4400 1395.0438 1401.7958 1434.6419 1441.5110 1447.1426 1449.4298 1460.4758 1460.8612 1462.5532 1469.0013 1475.0855 1479.1419 1482.2178 1483.0272 1494.2151 1497.2170 1589.9253 1590.0599 1614.5756 1618.7866 2955.6160 2955.7927 2989.6528 2989.9156 2999.7533 3001.1772 3008.4797 3010.8018 3017.3246 3019.9290 3057.8940 3060.0631 3070.8230 3074.7329 3086.8250 3086.9971 3095.6268 3096.3888 3119.3741 3120.2063 3126.7223 3128.5164 3139.8255 3141.0343 3158.9422 3159.8200
redmass: 4.2033 3.7096 2.5739 3.8396 2.2372 2.0252 3.9943 3.4142 3.6257 3.3780 4.7701 2.5011 2.9973 2.4472 1.4517 2.6174 1.3329 2.9516 2.8914 3.1938 3.2690 2.8128 2.7188 2.4813 6.1076 3.1441 4.0684 2.6864 2.9814 5.2723 4.4078 3.3859 3.2474 2.6466 3.4377 5.8298 5.7644 5.4341 4.2002 2.9477 5.5548 1.5560 1.4663 2.4124 2.2414 2.5461 1.0918 1.1046 2.8451 1.5961 1.8720 1.5978 3.3406 2.6214 1.4793 2.2908 1.4544 2.0727 1.3338 1.3189 7.0067 2.5717 2.1894 2.3694 2.8268 2.5828 4.3404 2.0156 2.5184 1.8461 2.8372 2.9292 2.0988 1.7417 1.4523 1.4867 1.2856 1.5428 1.0832 1.4112 1.8617 1.9194 1.4950 1.6892 1.1906 1.2099 1.8568 1.6961 1.5260 1.9741 1.4794 1.4006 1.3338 1.4445 1.3605 1.3058 7.7724 1.2546 1.2630 3.9440 2.1728 2.4023 1.1012 1.1348 1.0416 1.0408 1.7753 1.0890 1.3184 1.0553 3.6749 1.0619 1.0831 1.0846 7.0688 6.3651 7.1923 6.8940 1.0585 1.0584 1.0360 1.0360 1.0606 1.0602 1.0607 1.0619 1.1020 1.1034 1.1007 1.1021 1.1023 1.1027 1.0989 1.0989 1.1011 1.1011 1.0849 1.0849 1.0890 1.0892 1.0944 1.0945 1.1003 1.1002
irintensity: 0.0080 0.0953 0.0001 0.0215 0.0143 1.9013 0.7355 2.0003 2.7277 0.1527 0.5398 7.6263 0.1969 0.0224 0.0929 2.0678 3.1323 0.1928 3.9988 0.0016 0.1995 4.4863 4.7968 0.2330 0.6634 6.3231 18.9007 0.3527 0.5236 0.4368 3.8652 7.3481 0.0013 0.2130 1.2324 3.6327 1.9782 0.9419 2.3415 39.4112 0.1424 78.6570 0.2382 79.0326 9.3491 0.0031 3.1639 1.0713 3.1858 1.3731 0.8163 0.2293 139.2041 8.2048 5.8724 6.6572 0.0152 6.7438 0.0445 0.2700 3.2139 6.9072 5.1458 3.2383 92.3321 7.1884 208.5691 35.0369 13.6734 5.7209 3.3121 1.8317 7.3538 1.5457 4.7120 5.4351 0.0253 11.7977 0.1444 8.9739 18.7476 13.0759 3.4527 0.0427 2.0238 0.9965 0.7942 15.4652 5.2724 1.7544 2.8088 7.6269 2.6186 20.3214 0.1225 0.4019 12.1640 20.2878 24.6198 0.8175 17.7692 24.2648 23.3972 0.6617 10.3105 9.3211 3.3355 0.3072 31.2252 4.5368 6.3330 1.9110 9.8254 0.8515 0.1036 0.8094 1.3167 0.8232 91.9708 0.6052 27.4002 37.1404 31.3598 4.0599 25.5290 9.8645 24.8800 30.6420 35.7714 7.5304 18.4069 29.4695 9.8735 62.9654 44.0972 38.2525 1.6219 7.3657 6.2063 3.8279 5.3215 63.0296 65.7664 11.0767
temp: 298.150 k
press: 1.00000 atm
elementType: 8 8 6 6 6 6 6 6 6 6 6 6 6 6 6 6 6 6 6 6 6 6 6 6 1 1 1 1 1 1 1 1 1 1 1 1 1 1 1 1 1 1 1 1 1 1 1 1 1 1
symmnumber: 1
zpe: 1109245.6 jmol-1
zpe.correction: 0.422489 hartree
zpe.thermalcorrener: 0.444751 hartree
zpe.thermalcorrenthalpy: 0.445696 hartree
zpe.thermalcorrgfe: 0.370451 hartree
zpe.sumelectzpe: -1002.626522 hartree
zpe.sumelectthermal: -1002.604260 hartree
zpe.sumelectthermalent: -1002.603316 hartree
zpe.sumelectthermalfe: -1002.678560 hartree
dipole: 1.0729 0.0000 0.0000
dipole: 1.0729
quadrupole: -128.9893 -130.7761 -150.0687
quadrupole: 0.0000 0.0030 -4.4085
quadrupole: 7.6221 5.8352 -13.4573 0.0000 0.0030 -4.4085
hfenergy: -1003.0490113 hartree
pointgroup: C01 [X(C22H26O2)]
dipole: -0.4221206 0.0005892 -0.0001675 debye
polarizability: 290.8301866|0.0165113|297.4278478|0.061984|12.0080299|142.5972065 unknown
InChI: InChI=1S/C22H26O2/c1-3-23-22(24-4-2)15-13-21(14-16-22)19-11-7-5-9-17(19)18-10-6-8-12-20(18)21/h5-12H,3-4,13-16H2,1-2H3
charge 0 multiplicity 1
50 atoms
O  -3.340939 1.019156 -0.661086
O  -3.344524 -1.006118 0.659558
C  0.616851 0.001134 0.001345
C  -0.296163 0.165014 -1.271771
C  -0.297799 -0.159955 1.273617
C  -2.498317 0.005345 -0.00026
C  -1.635418 -0.588462 -1.139407
C  -1.635083 0.596863 1.139835
C  1.592164 -1.18416 -0.110218
C  1.595944 1.183232 0.113487
C  2.946565 -0.736533 -0.069561
C  2.948908 0.731246 0.072987
C  1.309687 -2.558031 -0.221741
C  1.317865 2.557977 0.225354
C  4.016303 -1.654272 -0.153927
C  4.021587 1.645503 0.157726
C  2.381626 -3.481898 -0.31199
C  2.392769 3.478349 0.316053
C  -4.232995 1.78556 0.236203
C  -4.237494 -1.770125 -0.238863
C  3.724999 -3.032564 -0.279751
C  3.734696 3.024689 0.283863
C  -5.226977 2.530777 -0.655144
C  -5.234578 -2.512711 0.65121
H  0.255722 -0.177405 -2.165463
H  -0.515471 1.238297 -1.424155
H  0.254087 0.181356 2.167733
H  -0.51997 -1.232623 1.426158
H  -2.204412 -0.524733 -2.083854
H  -1.450863 -1.657648 -0.928072
H  -2.205218 0.53451 2.083688
H  -1.447659 1.665604 0.92876
H  0.27746 -2.925963 -0.231417
H  0.286813 2.929163 0.235041
H  5.056411 -1.310544 -0.119638
H  5.060586 1.298428 0.123568
H  2.170224 -4.553426 -0.402282
H  2.184825 4.550527 0.406667
H  -4.745412 1.086994 0.926688
H  -3.637156 2.500392 0.841194
H  -4.747162 -1.070204 -0.930014
H  -3.642786 -2.486532 -0.843101
H  4.541817 -3.760086 -0.346714
H  4.553838 3.749562 0.351163
H  -5.910962 3.145316 -0.041019
H  -4.695573 3.196098 -1.357841
H  -5.829867 1.819237 -1.245973
H  -5.919339 -3.125517 0.03622
H  -4.705804 -3.179344 1.354641
H  -5.836405 -1.799575 1.241202
